{"text_format":"1","workbook":"xlsx","n_sheets":9,"sheets":["Istruzioni","SX","SA10","SA10 V2","SA10_pre","SA101","SA102","DATI_IMPORTAZIONE","readme"],"not_rendered":{"charts":0,"images":0,"macros":1,"external_links":0,"defined_names":2,"comments":5,"pivot_tables":0},"unopened":[],"bounds":{"document_bytes":16777216,"sheet_cells":100000,"rows_first":2000,"rows_last":500,"rows_between":2000,"halvings":0,"cell_chars":16384,"cell_head_chars":4096},"cells_cut":0,"cells_raw":0,"read":"whole","date_system":"1900"}

{"sheet":"Istruzioni","index":0,"n_rows":40,"n_cols":3,"rows_kept":40,"cut":false,"hidden":false,"merged":[[30,1,30,2],[36,1,36,2],[0,0,0,2],[1,0,1,2],[8,1,8,2],[14,1,14,2],[21,1,21,2]]}
["Statistica ospedaliera: file 'KS_Importazione_Immobilizzazioni.xlsm'"]
["(V_dati_2020, 2021-02-15)"]
[]
["0)","Istruzioni"]
[null,"L' Unità Statistiche Sanitarie mette a disposizione degli istituti un programma Excel che facilita la creazione"]
[null,"del file di testo per importare le immobilizzazioni nella statistica ospedaliera KS (evitando quindi di immettere"]
[null,"le posizioni manualmente in 'KS-online')."]
[]
["I)","Dati di intestazione (foglio 'SX')"]
[null,"►","Immettere i dati nelle celle vuote"]
[null,"►","Controllare i dati con l'apposito pulsante ed evtl. correggere gli errori riportati"]
[null,null,"Nell'ultima riga si può vedere la struttura del record 'SX' che sarà salvato nel file di importazione"]
[null,"►","Passare al prossimo foglio con l'apposito pulsante"]
[null,null,"ß"]
["II)","Dati sulle categorie delle immobilizzazioni: numero di investimenti e durata di utilizzo in anni (foglio 'SA10')"]
[null,"►","Immettere i dati nelle celle vuote"]
[null,"►","Controllare i dati con l'apposito pulsante ed evtl. correggere gli errori riportati"]
[null,"►","Infine aggiornare le strutture 'SA101' e 'SA102' con l'apposito pulsante (verranno così inserite le righe vuote necessarie nei due fogli seguenti)"]
[null,null,"Nell'ultima riga si può vedere la struttura del record 'SA10' che sarà salvato nel file di importazione"]
[null,"►","Passare al prossimo foglio con l'apposito pulsante"]
[null,null,"ß"]
["III)","Dati sull contabilità delle immobilizzazioni tramite operazioni di acquisto (foglio 'SA101')"]
[null,"►","Immettere i dati nelle celle vuote (una riga per ogni immobilizzazione)"]
[null,"-","L'interesse calcolatorio (colonna J) viene proposto con la formula '=3.7% * valore_di_acquisto / 2' (rispettivamente, per i terreni, con la formula '=3.7% * valore_di_acquisto'), ma può anche essere sovrascritto con un altro valore"]
[null,"-","L'interesse calcolatorio (colonna J) risulta uguale a 0 Fr. se il valore contabile a inzio anno e il valore contabile a fine anno sono entrambi <=1 Fr."]
[null,"-","Il costo di utilizzo (colonna K) viene proposto con la formula '=ammortamento + interessi_calcolatori', ma può anche essere sovrascritto con un altro valore"]
[null,"►","Controllare i dati con l'apposito pulsante ed evtl. correggere gli errori riportati"]
[null,null,"Nell'ultima colonna si può vedere la struttura dei records 'SA101' che saranno salvati nel file di importazione"]
[null,"►","Passare al prossimo foglio con l'apposito pulsante"]
[null,null,"ß"]
["IV)","Dati sulla contabilità delle immobilizzazioni tramite operazioni di locazione e acquisto rateale (foglio 'SA102')"]
[null,"►","Immettere i dati nelle celle vuote (una riga per ogni immobilizzazione)"]
[null,"►","Controllare i dati con l'apposito pulsante ed evtl. correggere gli errori riportati"]
[null,null,"Nell'ultima colonna si può vedere la struttura dei records 'SA102' che saranno salvati nel file di importazione"]
[null,"►","Passare al prossimo foglio con l'apposito pulsante"]
[null,null,"ß"]
["V)","Creare il file di importazione (foglio 'DATI_IMPORTAZIONE') e importare in KS"]
[null,"►","Selezionare tutte le righe riempite della colonna A, copiarle (Ctrl+C) e incollarle (Ctrl+V) in un file di testo (ad esempio nel programma 'Blocco Note')"]
[null,"►","Salvare il file di testo, ad esempio come 'Immobilizzazioni_AAAA.txt' oppure come 'Immobilizzazioni_AAAA.dat' (dove AAAA = anno del rilevamento)"]
[null,"►","Accedere a 'KS-online' (https://www.ks.bfs.admin.ch ) e importare il file utilizzando la funzione 'Importare questionario'"]

{"sheet":"SX","index":1,"n_rows":11,"n_cols":37,"rows_kept":11,"cut":false,"hidden":false,"merged":[[2,10,2,32],[8,0,8,33]]}
["Record 'intestazione'"]
[]
[null,null,null,null,null,null,null,null,null,null,"Dati capitolo Sxnn presenti\n(0 = No, 1 = Si)"]
["Tipo record","Versione","Tipo questionario","Utente importazione","Ambiente importazione","Anno dati","Bur no","Nome appicazione","Versione applicazione","Data creazione file","Dati SA1 presenti","Dati SA2 presenti","Dati SA3 presenti","Dati SA4 presenti","Dati SA5 presenti","Dati SA6 presenti","Dati SA7 presenti","Dati SA8 presenti","Dati SA9 presenti","Dati SA10 presenti","Dati SA11 presenti","Dati SB1 presenti","Dati SB201 presenti","Dati SB202 presenti","Dati SC1 presenti","Dati SC201 presenti","Dati SC202 presenti","Dati SD1 presenti","Dati SD201 presenti","Dati SD202 presenti","Dati SE1 presenti","Dati SE201 presenti","Dati SE202 presenti","Data validazione"]
[null,null,null,null,null,null,"A.02.06"]
[1,2,3,4,5,6,7,8,9,10,11,12,13,14,15,16,17,18,19,20,21,22,23,24,25,26,27,28,29,30,31,32,33,34]
["SX",4,"K",1,"P",2020,6505,"KS_import_immob","V5.3","202102151200",0,0,0,0,0,0,0,0,0,1,0,0,0,0,0,0,0,0,0,0,0,0,0,"20210215",{"$f":"CONCATENATE(A7,\"|\",B7,\"|\",C7,\"|\",D7,\"|\",E7,\"|\",F7,\"|\",G7,\"|\",H7,\"|\",I7,\"|\",J7,\"|\",K7,\"|\",L7,\"|\",M7,\"|\",N7,\"|\",O7,\"|\")","v":"SX|4|K|1|P|2020|6505|KS_import_immob|V5.3|202102151200|0|0|0|0|0|"},{"$f":"CONCATENATE(P7,\"|\",Q7,\"|\",R7,\"|\",S7,\"|\",T7,\"|\",U7,\"|\",V7,\"|\",W7,\"|\",X7,\"|\",Y7,\"|\",Z7,\"|\",AA7,\"|\",AB7,\"|\",AC7,\"|\",AD7,\"|\")","v":"0|0|0|0|1|0|0|0|0|0|0|0|0|0|0|"},{"$f":"CONCATENATE(AE7,\"|\",AF7,\"|\",AG7,\"|\",AH7,\"|\")","v":"0|0|0|20210215|"}]
[]
[{"$f":"CONCATENATE(AI7,AJ7,AK7)","v":"SX|4|K|1|P|2020|6505|KS_import_immob|V5.3|202102151200|0|0|0|0|0|0|0|0|0|1|0|0|0|0|0|0|0|0|0|0|0|0|0|20210215|"}]
[]
[null,null,null,null,null,null,null,null,null,"OK!"]

{"sheet":"SA10","index":2,"n_rows":36,"n_cols":16,"rows_kept":36,"cut":false,"hidden":false,"merged":[[30,1,30,15],[31,1,31,15],[32,1,32,15],[3,4,3,6],[3,8,3,10],[3,13,3,15],[29,1,29,15]]}
["Record 'dati generali-contabilità delle immobilizzazioni'"]
[null,null,null,null,"Tipo record",1,"SA10"]
[null,"ATTENZIONE: registrare solo investimenti a partire da un valore contabile di 10'000 Fr."]
[null,null,null,null,"Immobilizzazioni tramite operazioni di acquisto (ACH)",null,null,null,"Durata di utilizzo in anni, \nsecondo disposizioni \nOCPre / REKOLE",null,null,null,null,"Immobilizzazioni tramite operazioni di locazione e acquisto rateale (LOC)"]
["1.","Immobilizzazioni materiali immobili",null,"ACH_TOT1",null,null,null,null,null,null,null,null,"LOC_TOT1"]
[null,"1.1 Terreni edificati e non edificati",null,"ACH_1_1","A.19.01.01",2,1,null,null,null,null,null,"LOC_1_1","A.19.01.40",27,0]
[null,"1.2 Edifici ospedalieri e altri edifici",null,"ACH_1_2","A.19.01.02",3,3,null,"A.19.01.20",15,20,null,"LOC_1_2","A.19.01.41",28,0]
[null,"1.3 Opere provvisorie",null,"ACH_1_3","A.19.01.03",4,1,null,"A.19.01.21",16,30,null,"LOC_1_3","A.19.01.42",29,0]
[]
[null,"Installazioni"]
[null,"1.4 Installazioni di esercizio generali",null,"ACH_1_4","A.19.01.04",5,1,null,"A.19.01.22",17,10,null,"LOC_1_4","A.19.01.43",30,0]
[null,"1.5 Installazioni specifiche delle immobilizzazioni",null,"ACH_1_5","A.19.01.05",6,2,null,"A.19.01.23",18,10,null,"LOC_1_5","A.19.01.44",31,0]
[]
["2.","Immobilizzazioni materiali mobili",null,"ACH_TOT2",null,null,null,null,null,null,null,null,"LOC_TOT2"]
[null,"2.1 Arredi, attrezzature (comprese le giacenze)",null,"ACH_2_1","A.19.01.06",7,1,null,"A.19.01.24",19,10,null,"LOC_2_1","A.19.01.45",32,0]
[null,"2.2 Macchine per ufficio, sist. di comunicazione",null,"ACH_2_2","A.19.01.07",8,1,null,"A.19.01.25",20,5,null,"LOC_2_2","A.19.01.46",33,1]
[null,"2.3 Veicoli",null,"ACH_2_3","A.19.01.08",9,2,null,"A.19.01.26",21,5,null,"LOC_2_3","A.19.01.47",34,2]
[null,"2.4 Apparecchi e utensili (d'esercizio)",null,"ACH_2_4","A.19.01.09",10,1,null,"A.19.01.27",22,5,null,"LOC_2_4","A.19.01.48",35,1]
[]
[null,"Immobilizzazioni tecnico-mediche"]
[null,"2.5 Macchinari, apparecchi, strumenti (compresi gli acquisti di sw)",null,"ACH_2_5","A.19.01.10",11,2,null,"A.19.01.28",23,8,null,"LOC_2_5","A.19.01.49",36,1]
[null,"2.6 Aggiornamenti software",null,"ACH_2_6","A.19.01.11",12,1,null,"A.19.01.29",24,4,null,"LOC_2_6","A.19.01.50",37,0]
[]
[null,"Immobilizzazioni informatiche"]
[null,"2.7 Hardware",null,"ACH_2_7","A.19.01.12",13,2,null,"A.19.01.30",25,5,null,"LOC_2_7","A.19.01.51",38,0]
[null,"2.8 Software",null,"ACH_2_8","A.19.01.13",14,2,null,"A.19.01.31",26,5,null,"LOC_2_8","A.19.01.52",39,0]
[]
[null,null,null,"Tasso d’interesse calcolatorio prescritto dalla legge","A.02.12",null,3.6999999999999998E-2]
[]
[null,{"$f":"CONCATENATE(G6,\"|\",G7,\"|\",G8,\"|\",G11,\"|\",G12,\"|\",G15,\"|\",G16,\"|\",G17,\"|\",G18,\"|\",G21,\"|\",G22,\"|\",G25,\"|\",G26,\"|\")","v":"1|3|1|1|2|1|1|2|1|2|1|2|2|"}]
[null,{"$f":"CONCATENATE(K7,\"|\",K8,\"|\",K11,\"|\",K12,\"|\",K15,\"|\",K16,\"|\",K17,\"|\",K18,\"|\",K21,\"|\",K22,\"|\",K25,\"|\",K26,\"|\")","v":"20|30|10|10|10|5|5|5|8|4|5|5|"}]
[null,{"$f":"CONCATENATE(P6,\"|\",P7,\"|\",P8,\"|\",P11,\"|\",P12,\"|\",P15,\"|\",P16,\"|\",P17,\"|\",P18,\"|\",P21,\"|\",P22,\"|\",P25,\"|\",P26,\"|\")","v":"0|0|0|0|0|0|1|2|1|1|0|0|0|"}]
[null,{"$f":"CONCATENATE(G2,\"|\",B30,B31,B32)","v":"SA10|1|3|1|1|2|1|1|2|1|2|1|2|2|20|30|10|10|10|5|5|5|8|4|5|5|0|0|0|0|0|0|1|2|1|1|0|0|0|"}]
[]
[null,null,"OK!"]
[null,null,"OK!"]

{"sheet":"SA10 V2","index":3,"n_rows":8,"n_cols":43,"rows_kept":8,"cut":false,"hidden":true,"merged":[[3,18,3,25],[3,26,3,30],[3,31,3,38],[2,1,2,13],[2,14,2,25],[2,26,2,38],[3,1,3,5],[3,6,3,13],[3,14,3,17]]}
["Record 'dati generali-contabilità delle immobilizzazioni'"]
[]
[null,"No. di immobilizzazioni tramite operazioni di acquisto\nACH_TOT12",null,null,null,null,null,null,null,null,null,null,null,null,"Durata di utilizzo prevista in anni",null,null,null,null,null,null,null,null,null,null,null,"No. di immobilizzazioni tramite operazioni di locazione e acquisto rateale\nLOC_TOT12"]
[null,"1.\nImmobilizzazioni\nmateriali immobili\nACH_TOT1\nNo. acquisti",null,null,null,null,"2.\nImmobilizzazioni\nmateriali mobili\nACH_TOT_2\nNo. acquisti",null,null,null,null,null,null,null,"1.\nImmobilizzazioni\nmateriali immobili\n\nDurata di utilizzo",null,null,null,"2.\nImmobilizzazioni\nmateriali mobili\n\nDurata di utilizzo",null,null,null,null,null,null,null,"1.\nImmobilizzazioni\nmateriali immobili\nLOC_TOT1\nNo. locazioni o acquisti rateali",null,null,null,null,"2.\nImmobilizzazioni\nmateriali mobili\nLOC_TOT2\nNo. Locazioni o acquisti rateali"]
["Tipo record","1.1 Terreni edificati e non edificati\nACH_1_1","1.2 Edifici ospedalieri e altri edifici\nACH_1_2","1.3 Opere provvisorie\nACH_1_3","1.4 Installazioni di esercizio generali\nACH_1_4","1.5 Installazioni specifiche delle immobilizzazioni\nACH_1_5","2.1 Arredi, attrezzature (comprese le giacenze)\nACH_2_1","2.2 Macchine per ufficio, sist. di comunicazione\nACH_2_2","2.3 Veicoli\nACH_2_3","2.4 Apparecchi e utensili (d'esercizio)\nACH_2_4","2.5 Macchinari, apparecchi, strumenti (compresi gli acquisti di software)\nACH_2_5","2.6 Aggiornamenti software\nACH_2_6","2.7 Hardware\nACH_2_7","2.8 Software\nACH_2_8","1.2 Edifici ospedalieri e altri edifici","1.3 Opere provvisorie","1.4 Installazioni di esercizio generali","1.5 Installazioni specifiche delle immobilizzazioni","2.1 Arredi, attrezzature (comprese le giacenze)","2.2 Macchine per ufficio, sist. di comunicazione","2.3 Veicoli","2.4 Apparecchi e utensili (d'esercizio)","2.5 Macchinari, apparecchi, strumenti (compresi gli acquisti di software)","2.6 Aggiornamenti software","2.7 Hardware","2.8 Software","1.1 Terreni edificati e non edificati\nLOC_1_1","1.2 Edifici ospedalieri e altri edifici\nLOC_1_2","1.3 Opere provvisorie\nLOC_1_3","1.4 Installazioni di esercizio generali\nLOC_1_4","1.5 Installazioni specifiche delle immobilizzazioni\nLOC_1_5","2.1 Arredi, attrezzature (comprese le giacenze)\nLOC_2_1","2.2 Macchine per ufficio, sist. di comunicazione\nLOC_2_2","2.3 Veicoli\nLOC_2_3","2.4 Apparecchi e utensili (d'esercizio)\nLOC_2_4","2.5 Macchinari, apparecchi, strumenti (compresi gli acquisti di software)\nLOC_2_5","2.6 Aggiornamenti software\nLOC_2_6","2.7 Hardware\nLOC_2_7","2.8 Software\nLOC_2_8"]
[null,"A.19.01.01","A.19.01.02","A.19.01.03","A.19.01.04","A.19.01.05","A.19.01.06","A.19.01.07","A.19.01.08","A.19.01.09","A.19.01.10","A.19.01.11","A.19.01.12","A.19.01.13","A.19.01.20","A.19.01.21","A.19.01.22","A.19.01.23","A.19.01.24","A.19.01.25","A.19.01.26","A.19.01.27","A.19.01.28","A.19.01.29","A.19.01.30","A.19.01.31","A.19.01.40","A.19.01.41","A.19.01.42","A.19.01.43","A.19.01.44","A.19.01.45","A.19.01.46","A.19.01.47","A.19.01.48","A.19.01.49","A.19.01.50","A.19.01.51","A.19.01.52"]
[1,2,3,4,5,6,7,8,9,10,11,12,13,14,15,16,17,18,19,20,21,22,23,24,25,26,27,28,29,30,31,32,33,34,35,36,37,38,39]
["SA10",1,3,0,0,0,0,0,0,0,0,0,0,0,0,0,0,0,0,0,0,0,0,0,0,0,0,0,0,0,0,0,0,0,0,0,0,1,0,{"$f":"CONCATENATE(A8,\"|\",B8,\"|\",C8,\"|\",D8,\"|\",E8,\"|\",F8,\"|\",G8,\"|\",H8,\"|\",I8,\"|\",J8,\"|\",K8,\"|\",L8,\"|\",M8,\"|\",N8,\"|\",O8,\"|\")","v":"SA10|1|3|0|0|0|0|0|0|0|0|0|0|0|0|"},{"$f":"CONCATENATE(P8,\"|\",Q8,\"|\",R8,\"|\",S8,\"|\",T8,\"|\",U8,\"|\",V8,\"|\",W8,\"|\",X8,\"|\",Y8,\"|\",Z8,\"|\",AA8,\"|\",AB8,\"|\",AC8,\"|\",AD8,\"|\")","v":"0|0|0|0|0|0|0|0|0|0|0|0|0|0|0|"},{"$f":"CONCATENATE(AE8,\"|\",AF8,\"|\",AG8,\"|\",AM8,\"|\")","v":"0|0|0|0|"},{"$f":"CONCATENATE(AN8,\"|\",AO8,AP8)","v":"SA10|1|3|0|0|0|0|0|0|0|0|0|0|0|0||0|0|0|0|0|0|0|0|0|0|0|0|0|0|0|0|0|0|0|"}]

{"sheet":"SA10_pre","index":4,"n_rows":28,"n_cols":16,"rows_kept":28,"cut":false,"hidden":true,"merged":[[3,4,3,6],[3,8,3,10],[3,13,3,15]]}
["Record 'dati generali-contabilità delle immobilizzazioni'"]
["(valori al momento dell'apertura del file Excel)",null,null,null,"Tipo record",1,"SA10"]
[]
[null,null,null,null,"Immobilizzazioni tramite operazioni di acquisto (ACH)",null,null,null,"Durata di utilizzo in anni, \nsecondo disposizioni \nOCPre / REKOLE",null,null,null,null,"Immobilizzazioni tramite operazioni di locazione e acquisto rateale (LOC)"]
["1.","Immobilizzazioni materiali immobili",null,"ACH_TOT1",null,null,null,null,null,null,null,null,"LOC_TOT1"]
[null,"1.1 Terreni edificati e non edificati",null,"ACH_1_1","A.19.01.01",2,1,null,null,null,null,null,"LOC_1_1","A.19.01.40",27,0]
[null,"1.2 Edifici ospedalieri e altri edifici",null,"ACH_1_2","A.19.01.02",3,3,null,"A.19.01.20",15,0,null,"LOC_1_2","A.19.01.41",28,0]
[null,"1.3 Opere provvisorie",null,"ACH_1_3","A.19.01.03",4,1,null,"A.19.01.21",16,0,null,"LOC_1_3","A.19.01.42",29,0]
[]
[null,"Installazioni"]
[null,"1.4 Installazioni di esercizio generali",null,"ACH_1_4","A.19.01.04",5,1,null,"A.19.01.22",17,0,null,"LOC_1_4","A.19.01.43",30,0]
[null,"1.5 Installazioni specifiche delle immobilizzazioni",null,"ACH_1_5","A.19.01.05",6,2,null,"A.19.01.23",18,0,null,"LOC_1_5","A.19.01.44",31,0]
[]
["2.","Immobilizzazioni materiali mobili",null,"ACH_TOT2",null,null,null,null,null,null,null,null,"LOC_TOT2"]
[null,"2.1 Arredi, attrezzature (comprese le giacenze)",null,"ACH_2_1","A.19.01.06",7,1,null,"A.19.01.24",19,0,null,"LOC_2_1","A.19.01.45",32,0]
[null,"2.2 Macchine per ufficio, sist. di comunicazione",null,"ACH_2_2","A.19.01.07",8,1,null,"A.19.01.25",20,0,null,"LOC_2_2","A.19.01.46",33,1]
[null,"2.3 Veicoli",null,"ACH_2_3","A.19.01.08",9,2,null,"A.19.01.26",21,0,null,"LOC_2_3","A.19.01.47",34,2]
[null,"2.4 Apparecchi e utensili (d'esercizio)",null,"ACH_2_4","A.19.01.09",10,1,null,"A.19.01.27",22,0,null,"LOC_2_4","A.19.01.48",35,1]
[]
[null,"Immobilizzazioni tecnico-mediche"]
[null,"2.5 Macchinari, apparecchi, strumenti (compresi gli acquisti di sw)",null,"ACH_2_5","A.19.01.10",11,2,null,"A.19.01.28",23,0,null,"LOC_2_5","A.19.01.49",36,1]
[null,"2.6 Aggiornamenti software",null,"ACH_2_6","A.19.01.11",12,1,null,"A.19.01.29",24,0,null,"LOC_2_6","A.19.01.50",37,0]
[]
[null,"Immobilizzazioni informatiche"]
[null,"2.7 Hardware",null,"ACH_2_7","A.19.01.12",13,2,null,"A.19.01.30",25,0,null,"LOC_2_7","A.19.01.51",38,0]
[null,"2.8 Software",null,"ACH_2_8","A.19.01.13",14,2,null,"A.19.01.31",26,0,null,"LOC_2_8","A.19.01.52",39,0]
[]
[null,null,null,null,null,null,{"$f":"G6+G7+G8+G11+G12+G15+G16+G17+G18+G21+G22+G25+G26","v":20},null,null,null,null,null,null,null,null,{"$f":"P6+P7+P8+P11+P12+P15+P16+P17+P18+P21+P22+P25+P26","v":5}]

{"sheet":"SA101","index":5,"n_rows":54,"n_cols":13,"rows_kept":54,"cut":false,"hidden":false,"merged":[[2,4,2,5],[2,6,2,10],[2,1,2,3]]}
["Records 'contabilità delle immobilizzazioni tramite operazioni di acquisto' "]
[null,null,null,null,null,null,null,null,null,null,null,null,"OK!"]
[null,"Immobilizzazione",null,null,"Acquisto",null,"Autodichiarazione secondo OCPre"]
["Tipo record","Conto","No. immobilizzazione (1,2,3,…)","Nome immobilizzazione","Valore d'acquisto in Fr.","Anno di acquisto","Valore contabile in Fr.\nInizio anno","Valore contabile in Fr.\nFine anno","Ammortamento annuo in Fr.","Interessi calcolatori in Fr.","Costi di utilizzo in Fr."]
[null,"A.19.02.xx.yyyy","A.19.02.xx.yyyy","A.19.02.xx.yyyy","A.19.02.xx.yyyy.1","A.19.02.xx.yyyy.2","A.19.02.xx.yyyy.3","A.19.02.xx.yyyy.4","A.19.02.xx.yyyy.5","A.19.02.xx.yyyy.6","A.19.02.xx.yyyy.7","Attenzione:\n- usare solo importi interi (senza centesimi)"]
[1,2,3,4,5,6,7,8,9,10,11]
["SA101","ACH_1_n",null,null,null,null,null,null,null,{"$f":"IF(AND(G7<=1,H7<=1),0,IF(B7=\"ACH_1_1\",TRUNC(3.7*E7/100),TRUNC(3.7*E7/2/100)))","v":0},{"$f":"+I7+J7","v":0},{"$f":"IF(C7<>\"\",CONCATENATE(A7,\"|\",B7,\"|\",C7,\"|\",D7,\"|\",E7,\"|\",F7,\"|\",G7,\"|\",H7,\"|\",I7,\"|\",J7,\"|\",K7,\"|\"),\"\")","v":""}]
["SA101","ACH_2_n",null,null,null,null,null,null,null,0,0,""]
["SA101","ACH_1_1",1,"terreno",2000000,2000,2000000,2000000,null,74000,{"$f":"+I9+J9","v":74000},{"$f":"IF(C9<>\"\",CONCATENATE(A9,\"|\",B9,\"|\",C9,\"|\",D9,\"|\",E9,\"|\",F9,\"|\",G9,\"|\",H9,\"|\",I9,\"|\",J9,\"|\",K9,\"|\"),\"\")","v":"SA101|ACH_1_1|1|terreno|2000000|2000|2000000|2000000||74000|74000|"}]
["SA101","ACH_1_2",1,"edificio_1",37900,1999,31700,29800,1900,701,2601,"SA101|ACH_1_2|1|edificio_1|37900|1999|31700|29800|1900|701|2601|"]
["SA101","ACH_1_2",2,"edificio_2",490000,1999,444000,420000,24000,9065,33065,"SA101|ACH_1_2|2|edificio_2|490000|1999|444000|420000|24000|9065|33065|"]
["SA101","ACH_1_2",3,"edificio_3",37800,1998,24300,23000,1200,699,1899,"SA101|ACH_1_2|3|edificio_3|37800|1998|24300|23000|1200|699|1899|"]
["SA101","ACH_1_3",1,"uffici_provvisori",280000,2010,1,1,279999,0,279999,"SA101|ACH_1_3|1|uffici_provvisori|280000|2010|1|1|279999|0|279999|"]
["SA101","ACH_1_4",1,"installazione_1",140000,2005,67500,54000,13500,2590,16090,"SA101|ACH_1_4|1|installazione_1|140000|2005|67500|54000|13500|2590|16090|"]
["SA101","ACH_1_5",1,"installazione_1",500000,1999,313000,213000,100000,9250,109250,"SA101|ACH_1_5|1|installazione_1|500000|1999|313000|213000|100000|9250|109250|"]
["SA101","ACH_1_5",2,"installazione_2",14200,1999,2100,1200,850,262,1112,"SA101|ACH_1_5|2|installazione_2|14200|1999|2100|1200|850|262|1112|"]
["SA101","ACH_TOT1",1,null,null,null,null,null,null,null,{"$f":"SUM(K9:K16)","v":518016},{"$f":"IF(B17<>\"\",CONCATENATE(A17,\"|\",B17,\"|\",C17,\"|\",D17,\"|\",E17,\"|\",F17,\"|\",G17,\"|\",H17,\"|\",I17,\"|\",J17,\"|\",K17,\"|\"),\"\")","v":"SA101|ACH_TOT1|1||||||||518016|"}]
["SA101","ACH_2_1",1,"oggetto",13600,2003,1200,880,360,{"$f":"IF(AND(G18<=1,H18<=1),0,IF(B18=\"ACH_1_1\",TRUNC(3.7*E18/100),TRUNC(3.7*E18/2/100)))","v":251},{"$f":"+I18+J18","v":611},{"$f":"IF(C18<>\"\",CONCATENATE(A18,\"|\",B18,\"|\",C18,\"|\",D18,\"|\",E18,\"|\",F18,\"|\",G18,\"|\",H18,\"|\",I18,\"|\",J18,\"|\",K18,\"|\"),\"\")","v":"SA101|ACH_2_1|1|oggetto|13600|2003|1200|880|360|251|611|"}]
["SA101","ACH_2_2",1,"macchina",12000,2009,6500,3000,3500,222,3722,"SA101|ACH_2_2|1|macchina|12000|2009|6500|3000|3500|222|3722|"]
["SA101","ACH_2_3",1,"veicolo_1",13500,2006,1000,150,900,249,1149,"SA101|ACH_2_3|1|veicolo_1|13500|2006|1000|150|900|249|1149|"]
["SA101","ACH_2_3",2,"veicolo_2",16700,2010,6700,5000,1700,308,2008,"SA101|ACH_2_3|2|veicolo_2|16700|2010|6700|5000|1700|308|2008|"]
["SA101","ACH_2_4",1,"apparecchio",17600,2007,2600,400,2200,325,2525,"SA101|ACH_2_4|1|apparecchio|17600|2007|2600|400|2200|325|2525|"]
["SA101","ACH_2_5",1,"apparecchio_1",15300,2003,0,0,0,0,0,"SA101|ACH_2_5|1|apparecchio_1|15300|2003|0|0|0|0|0|"]
["SA101","ACH_2_5",2,"apparecchio_2",25000,2006,15300,12800,2500,462,2962,"SA101|ACH_2_5|2|apparecchio_2|25000|2006|15300|12800|2500|462|2962|"]
["SA101","ACH_2_6",1,"SW Exchange",46000,2007,1,1,0,0,0,"SA101|ACH_2_6|1|SW Exchange|46000|2007|1|1|0|0|0|"]
["SA101","ACH_2_7",1,"hardware_1",35000,2004,0,0,0,0,0,"SA101|ACH_2_7|1|hardware_1|35000|2004|0|0|0|0|0|"]
["SA101","ACH_2_7",2,"hardware_2",17000,2008,2300,0,2300,314,2614,"SA101|ACH_2_7|2|hardware_2|17000|2008|2300|0|2300|314|2614|"]
["SA101","ACH_2_8",1,"software_1",115000,2004,0,0,0,0,0,"SA101|ACH_2_8|1|software_1|115000|2004|0|0|0|0|0|"]
["SA101","ACH_2_8",2,"software_2",24000,2009,20000,16000,8000,444,8444,"SA101|ACH_2_8|2|software_2|24000|2009|20000|16000|8000|444|8444|"]
["SA101","ACH_TOT2",1,null,null,null,null,null,null,null,{"$f":"SUM(K18:K29)","v":24035},{"$f":"IF(B30<>\"\",CONCATENATE(A30,\"|\",B30,\"|\",C30,\"|\",D30,\"|\",E30,\"|\",F30,\"|\",G30,\"|\",H30,\"|\",I30,\"|\",J30,\"|\",K30,\"|\"),\"\")","v":"SA101|ACH_TOT2|1||||||||24035|"}]
["SA101","ACH_TOT12",1,null,null,null,null,null,null,null,{"$f":"K17+K30","v":542051},{"$f":"IF(B31<>\"\",CONCATENATE(A31,\"|\",B31,\"|\",C31,\"|\",D31,\"|\",E31,\"|\",F31,\"|\",G31,\"|\",H31,\"|\",I31,\"|\",J31,\"|\",K31,\"|\"),\"\")","v":"SA101|ACH_TOT12|1||||||||542051|"}]
[]
[]
[]
[]
[]
[]
[]
[]
[]
[]
[]
[]
[]
[]
[]
[]
[]
[]
[]
[]
[]
[]
[null,null,"ERRORE!"]

{"sheet":"SA102","index":6,"n_rows":17,"n_cols":7,"rows_kept":17,"cut":false,"hidden":false,"merged":[[2,1,2,3]]}
["Records 'contabilità delle immobilizzazioni tramite operazioni di locazione e di acquisto rateale' "]
[null,null,null,null,null,null,"OK!"]
[null,"Immobilizzazione",null,null,"costi di utilizzo"]
["Tipo record","Conto","No. immobilizzazione (1,2,3,…)","Nome immobilizzazione","Costi di utilizzo in Fr. (valori effettivi)"]
[null,"A.19.03.xx.yyyy","A.19.03.xx.yyyy","A.19.03.xx.yyyy","A.19.03.xx.yyyy","Attenzione:\n- usare solo importi interi (senza centesimi)"]
[1,2,3,4,5,"\n"]
["SA102","LOC_1_n",null,null,null,{"$f":"IF(C7<>\"\",CONCATENATE(A7,\"|\",B7,\"|\",C7,\"|\",D7,\"|\",E7,\"|\"),\"\")","v":""}]
["SA102","LOC_2_n",null,null,null,{"$f":"IF(C8<>\"\",CONCATENATE(A8,\"|\",B8,\"|\",C8,\"|\",D8,\"|\",E8,\"|\"),\"\")","v":""}]
["SA102","LOC_TOT1",1,null,0,{"$f":"IF(B9<>\"\",CONCATENATE(A9,\"|\",B9,\"|\",C9,\"|\",D9,\"|\",E9,\"|\"),\"\")","v":"SA102|LOC_TOT1|1||0|"}]
["SA102","LOC_2_2",1,"fotocopiatrice",16000,{"$f":"IF(C10<>\"\",CONCATENATE(A10,\"|\",B10,\"|\",C10,\"|\",D10,\"|\",E10,\"|\"),\"\")","v":"SA102|LOC_2_2|1|fotocopiatrice|16000|"}]
["SA102","LOC_2_3",1,"veicolo_1",24000,{"$f":"IF(C11<>\"\",CONCATENATE(A11,\"|\",B11,\"|\",C11,\"|\",D11,\"|\",E11,\"|\"),\"\")","v":"SA102|LOC_2_3|1|veicolo_1|24000|"}]
["SA102","LOC_2_3",2,"veicolo_2",19000,{"$f":"IF(C12<>\"\",CONCATENATE(A12,\"|\",B12,\"|\",C12,\"|\",D12,\"|\",E12,\"|\"),\"\")","v":"SA102|LOC_2_3|2|veicolo_2|19000|"}]
["SA102","LOC_2_4",1,"lavatrice",6000,{"$f":"IF(C13<>\"\",CONCATENATE(A13,\"|\",B13,\"|\",C13,\"|\",D13,\"|\",E13,\"|\"),\"\")","v":"SA102|LOC_2_4|1|lavatrice|6000|"}]
["SA102","LOC_2_5",1,"strumento",680000,{"$f":"IF(C14<>\"\",CONCATENATE(A14,\"|\",B14,\"|\",C14,\"|\",D14,\"|\",E14,\"|\"),\"\")","v":"SA102|LOC_2_5|1|strumento|680000|"}]
["SA102","LOC_TOT2",1,null,{"$f":"SUM(E10:E14)","v":745000},{"$f":"IF(B15<>\"\",CONCATENATE(A15,\"|\",B15,\"|\",C15,\"|\",D15,\"|\",E15,\"|\"),\"\")","v":"SA102|LOC_TOT2|1||745000|"}]
["SA102","LOC_TOT12",1,null,{"$f":"E9+E15","v":745000},{"$f":"IF(B16<>\"\",CONCATENATE(A16,\"|\",B16,\"|\",C16,\"|\",D16,\"|\",E16,\"|\"),\"\")","v":"SA102|LOC_TOT12|1||745000|"}]
["SA102","TOT12",1,null,{"$f":"+E16+'SA101'!K31","v":1287051},{"$f":"IF(B17<>\"\",CONCATENATE(A17,\"|\",B17,\"|\",C17,\"|\",D17,\"|\",E17,\"|\"),\"\")","v":"SA102|TOT12|1||1287051|"}]

{"sheet":"DATI_IMPORTAZIONE","index":7,"n_rows":34,"n_cols":1,"rows_kept":34,"cut":false,"hidden":false,"merged":[]}
[{"$f":"SX!A9","v":"SX|4|K|1|P|2020|6505|KS_import_immob|V5.3|202102151200|0|0|0|0|0|0|0|0|0|1|0|0|0|0|0|0|0|0|0|0|0|0|0|20210215|"}]
[{"$f":"'SA10'!B33","v":"SA10|1|3|1|1|2|1|1|2|1|2|1|2|2|20|30|10|10|10|5|5|5|8|4|5|5|0|0|0|0|0|0|1|2|1|1|0|0|0|"}]
["SA101|ACH_1_1|1|terreno|2000000|2000|2000000|2000000||74000|74000|"]
["SA101|ACH_1_2|1|edificio_1|37900|1999|31700|29800|1900|701|2601|"]
["SA101|ACH_1_2|2|edificio_2|490000|1999|444000|420000|24000|9065|33065|"]
["SA101|ACH_1_2|3|edificio_3|37800|1998|24300|23000|1200|699|1899|"]
["SA101|ACH_1_3|1|uffici_provvisori|280000|2010|1|1|279999|0|279999|"]
["SA101|ACH_1_4|1|installazione_1|140000|2005|67500|54000|13500|2590|16090|"]
["SA101|ACH_1_5|1|installazione_1|500000|1999|313000|213000|100000|9250|109250|"]
["SA101|ACH_1_5|2|installazione_2|14200|1999|2100|1200|850|262|1112|"]
["SA101|ACH_TOT1|1||||||||518016|"]
["SA101|ACH_2_1|1|oggetto|13600|2003|1200|880|360|251|611|"]
["SA101|ACH_2_2|1|macchina|12000|2009|6500|3000|3500|222|3722|"]
["SA101|ACH_2_3|1|veicolo_1|13500|2006|1000|150|900|249|1149|"]
["SA101|ACH_2_3|2|veicolo_2|16700|2010|6700|5000|1700|308|2008|"]
["SA101|ACH_2_4|1|apparecchio|17600|2007|2600|400|2200|325|2525|"]
["SA101|ACH_2_5|1|apparecchio_1|15300|2003|0|0|0|0|0|"]
["SA101|ACH_2_5|2|apparecchio_2|25000|2006|15300|12800|2500|462|2962|"]
["SA101|ACH_2_6|1|SW Exchange|46000|2007|1|1|0|0|0|"]
["SA101|ACH_2_7|1|hardware_1|35000|2004|0|0|0|0|0|"]
["SA101|ACH_2_7|2|hardware_2|17000|2008|2300|0|2300|314|2614|"]
["SA101|ACH_2_8|1|software_1|115000|2004|0|0|0|0|0|"]
["SA101|ACH_2_8|2|software_2|24000|2009|20000|16000|8000|444|8444|"]
["SA101|ACH_TOT2|1||||||||24035|"]
["SA101|ACH_TOT12|1||||||||542051|"]
["SA102|LOC_TOT1|1||0|"]
["SA102|LOC_2_2|1|fotocopiatrice|16000|"]
["SA102|LOC_2_3|1|veicolo_1|24000|"]
["SA102|LOC_2_3|2|veicolo_2|19000|"]
["SA102|LOC_2_4|1|lavatrice|6000|"]
["SA102|LOC_2_5|1|strumento|680000|"]
["SA102|LOC_TOT2|1||745000|"]
["SA102|LOC_TOT12|1||745000|"]
["SA102|TOT12|1||1287051|"]

{"sheet":"readme","index":8,"n_rows":2,"n_cols":4,"rows_kept":2,"cut":false,"hidden":true,"merged":[]}
["Versione","Data","Autore","Descrizione"]
["V_dati_2017","2018-03-15","F. Menozzi","Versione per rilevamento dati 2017:\n- file in formato .xlsm (invece di .xls)\n- rifatto completamente i pulsanti e il flusso fra i fogli\n- aggiunto controlli errori\n"]