{"text_format":"1","workbook":"xlsx","n_sheets":13,"sheets":["Parametri","Istruzioni generali e COAN","COAN Verifica","Ripartizioni","Contabilità per CDC - UACD","Contabilità per UFI 1","Contabilità per UFI 2","Contabilità per CDC - SOMED","Contabilità per UFI - SOMED","Istruzioni COIN","Codici COIN","Cespiti ContabilitàInvestimenti","Resoconti COIN"],"not_rendered":{"charts":0,"images":0,"macros":1,"external_links":0,"defined_names":20,"comments":3,"pivot_tables":0},"unopened":[],"bounds":{"document_bytes":16777216,"sheet_cells":100000,"rows_first":2000,"rows_last":500,"rows_between":2000,"halvings":0,"cell_chars":16384,"cell_head_chars":4096},"cells_cut":0,"cells_raw":0,"read":"whole","date_system":"1900"}

{"sheet":"Parametri","index":0,"n_rows":25,"n_cols":4,"rows_kept":25,"cut":false,"hidden":false,"merged":[]}
["Parametri"]
[]
["Nome istituto:","ESEMPIO - CPA STANDARD CON CAT-STT"]
[]
["Bur_nr:",99999999,null,"Il numero BUR è necessario per SOMED. Se non lo conoscete trovate il numero del vostro Istituto nelle istruzioni SOMED."]
[]
["Anno dati:",2021]
[]
["Percorso files per SOMED:","C:\\temp",null,"Specificare il percorso dove verrà creato e salvato il file che dovrà poi essere importato in SOMED-A Online. Specificare un percorso valido (che esiste) nel vostro PC."]
[]
["Estensione files per SOMED:","dat",null,"L'estensione in uso per il file dati SOMED è \"dat\". \nÈ possibile utilizzarne anche altre (es. \"txt\"). "]
[]
["Tasso d'interesse applicato:",3.6999999999999998E-2,null,"Valore normativo non modificabile"]
[]
[]
[]
["Data di calcolo:",{"$f":"DATE(B7,12,31)","v":"2021-12-31"}]
[]
["Data/ora creazione files:",{"$f":"TEXT(NOW(),\"aaaammgghhmmss\")","v":"20220221111902"}]
[]
["Nome file investimenti:",{"$f":"$B$9 & \"\\Somed_Investimenti_\" & $B$7 & \"_\" & $B$5 & \".\"&$B$11","v":"C:\\temp\\Somed_Investimenti_2021_99999999.dat"},null,"Il file che verrà creato a questo indirizzo conterrà i dati del capitolo E4 di SOMED e dovrà essere caricato in SOMED online."]
[]
["Nome file costi/ricavi:",{"$f":"$B$9 & \"\\Somed_Costi_Ricavi_\" & $B$7 & \"_\" & $B$5 & \".\"&$B$11","v":"C:\\temp\\Somed_Costi_Ricavi_2021_99999999.dat"},null,"Il file che verrà creato a questo indirizzo conterrà i dati dei capitoli E0, E1, E2, E5 ed E6 di SOMED e dovrà essere caricato in SOMED-A Online. \nIl capitolo E3 (risultato d'esercizio) dovrà essere compilato a mano nel questionario SOMED-A Online."]
[]
["Versione 2022-02-21, 12:00, MEF-CHL"]

{"sheet":"Istruzioni generali e COAN","index":1,"n_rows":60,"n_cols":9,"rows_kept":60,"cut":false,"hidden":false,"merged":[[33,0,34,0],[33,1,34,1]]}
["Istruzioni generali ",null,null,null,"Istruzioni per la contabilità analitica",null,null,"Istruzioni per la contabilità analitica (continuazione)"]
[]
["Spiegazioni sui colori usati nei diversi fogli  ",null,null,null,"Non esiste un'unica sequenza possibile di passi per compilare i fogli, dato che ogni foglio si basa, in parte,",null,null,"CD","Il pulsante CANCELLA DATI elimina tutti i dati sul foglio (lasciando le formule). Questo programma "]
[null,null,null,null,"su dati contenuti in altri fogli. Indichiamo una delle possibili sequenze per completare la COAN. ",null,null,null,"è da lanciare quando si modifica la contabilità per CdC per UACD, ad esempio per un errore o"]
["Per facilitare il lavoro con il file Excel COAN-COIN sono stati formattati i diversi fogli in modo uniforme. ",null,null,null,"Oltre alle istruzioni riportate sotto, altre più dettagliate si trovano nei singoli fogli di lavoro. ",null,null,null,"perché si stanno aggiornando i dati di un nuovo anno contabile. "]
["In particolare, nei fogli da completare, si è adottato la seguente colorazione: "]
[null,null,null,null,null,null,null,"ID","Il pulsante IMPORTA DATI compila il foglio \"Contabilità per CDC - SOMED\" con i dati del foglio"]
[null,"celle con sfondo bianco",": campi dove digitare/compilare le informazioni richieste",null,"Istruzioni e sequenza suggerita per il lavoro con i fogli Excel COAN:",null,null,null,"\"Contabilità per CDC - UACD\", e più precisamente copiando i dati solo delle celle con sfondo bianco, violetto"]
[null,"celle celesti",": campi con valori fissi o menu a tendina ",null,null,null,null,null," e grigio chiaro. L'importazione dei dati presenta le seguenti caratteristiche: "]
[null,"celle verdi",": campi calcolati automaticamente",null,1,"Compilare il foglio \"Ripartizioni\", in particolare aggiornare i dati annuali e scegliere il metodo ",null,null,"A) Le righe seguenti non sono copiate dal foglio \"Contabilità CDC - UACD\" ma seguono altre regole: "]
[null,"celle grigie",": campi che non contengono dati",null,null,"per esporre gli oneri sociali. Vedi le istruzioni nel foglio. ",null,null,"  - Conto 37: gli oneri sociali sono calcolati (formule nella riga 37) in base ai salari esposti nelle righe soprastanti (c.ti"]
[null,null,null,null,null,null,null,null,"   3000 a 3005) e al totale degli oneri sociali (colonna E). Quindi i dati in questa riga si modificheranno ogni volta che"]
[null,null,null,null,2,"Compilare il foglio \"Contabilità per CDC - UACD\" con i dati del vostro sistema di contabilità analitica. ",null,null,"     le delimitazioni saranno modificate e i salari delle colonne violette spostati sotto i CdC principali"]
["Fogli in questo file e loro utilità",null,null,null,null,"Non si sa in che misura il passaggio dei dati dal vostro sistema gestionale al file Excel sia automatizzato. ",null,null,"  - Neutralizzazione cassa pensione: tralasciato in quanto non considerato per SOMED"]
[null,null,null,null,null,"Se è stato automatizzato, per esportare i dati bisogna seguire le istruzioni del vostro sviluppatore",null,null,"  - Conti 442 e 448: i dati provengono dalla COIN per SOMED"]
[1,"Parametri ","I parametri servono sia per la COAN sia per la COIN",null,null,"informatico. ",null,null,"  - Conti 443 e 444: i dati sono tralasciati poiché l'istituto deve, nel caso di locazioni, elencare i relativi investimenti "]
[null,null,null,null,null,"Inoltre occorre prestare particolare attenzione ai costi degli investimenti (conti 442, 443, 444, 448 e 46).",null,null,"     nella COIN per SOMED"]
[2,"Istruzioni generali e COAN ",null,null,null,"Da notare che, nei ricavi, le celle bianche contornate dovrebbero tutte contenere i relativi importi. ",null,null,"  - Conto 66: i dati sono tralasciati poiché non considerati (per la Statistica SOMED-A) parte dell'attività dell'Istituto."]
[3,"COAN verifica ","Verifica la completezza e la coerenza dei dati per UACD",null,null,null,null,null,"  - Conto EX 7: i dati del conto 7 non sono ricopiati dalla contabilità UACD, visto che le gestioni straordinarie ed"]
[4,"Ripartizioni ","I parametri definiti vengono applicati ai fogli 5, 6, 7, 8 e 9 ",null,3,"Esaminare il foglio \"COAN Verifica\". Se ci sono degli errori correggere i dati nei fogli \"Ripartizioni\" e/o ",null,null,"     estranee non compaiono in SOMED"]
[5,"Contabilità per CDC - UACD","Foglio generale della COAN",null,null,"\"Contabilità per CDC - UACD\", fino a eliminare tutti gli errori.",null,null,"     Al posto di questi (e impropriamente) nella riga EX 7 sono esposti i costi ripartiti, nella contabilità per UACD, "]
[6,"Contabilità per UFI 1 ","Contabilità per UFI 1 per UACD",null,null,null,null,null,"     sui CdC DELIMITATI per la SOMED, algine di ridurre in modo adeguato il totale dei costi generali da ripartire"]
[7,"Contabilità per UFI 2","Contabilità per UFI 2 per UACD",null,"Dopo questi tre passi e dopo avere allestito la contabilità degli investimenti (foglio \"Cespiti ContabilitàInvestimenti\"),",null,null,null,"  - Costi netti prima delle ripartizioni: grazie alla riga EX 7, si ottengono i nuovi costi dei CdC generali da ripartire, "]
[null,null,"Questo foglio permette di ri-elaborare i dati del foglio 5 secondo le ",null,"si possono esaminare i risultati nei fogli \"Contabilità per UFI 1 e 2\" per UACD.",null,null,null,"     già epurati dei costi generali dei CdC delimitati (tralasciati) per SOMED."]
[8,"Contabilità per CDC - SOMED ","necessità SOMED, in particolare serve per tralasciare i CdC che non",null,null,null,null,null,"  - Conto 609: le perdite sui debitori di anni precedenti non sono ricopiati in quanto da tralasciare per SOMED"]
[null,null,"devono entrare nella Statistica SOMED-A",null,4,"Il foglio \"Contabilità per UFI 1\" per UACD è interamente calcolato, ad eccezione dell'aliquota per la \"Cura LAMal\", ",null,null,"  - Risultato di gestione: questa riga non è ricopiata dalla contabilità per UACD bensì ricalcolata con i nuovi dati SOMED. "]
[null,null,"Questo foglio permette di elaborare ulteriormente i dati del foglio 8 ",null,null,"che può essere se del caso modificata, digitando i nuovi dati nella colonna con sfondo bianco. "]
[9,"Contabilità per UFI - SOMED","in modo da predisporre i dati per il questionario SOMED-A. Inoltre in questo",null,null,"(da notare che l'aliquota della \"Cura non LAMal\" è dedotta dalla precedente). ",null,null,"B) Inoltre la colorazione dei diversi CdC (colonne) ha il seguente significato: "]
[null,null,"foglio c'è il bottone per creare il file di esportazione per SOMED-A Online.",null,null,null,null,null,"   - sfondo bianco: CdC rilevanti per SOMED, vanno mantenuti"]
[null,null,null,null,5,"Nel foglio \"Contabilità per UFI 2\" per UACD occorre inserire le giornate LAMal a cui si riferiscono i dati contabili. ",null,null,"   - sfondo violetto: CdC i cui costi devono essere inclusi in SOMED, non possono essere lasciati come servizi "]
[10,"Istruzioni COIN ",null,null,null,"Le giornate, da inserire nelle celle su sfondo bianco, non devono comprendere le giornate del settore",null,null,"     annessi a sé stanti (perché tali CdC non sono previsti dalla Statistica SOMED-A) e pertanto devono essere"]
[11,"Codici COIN ","Tabelle di nomenclatura per la COIN (definizioni)",null,null,"CAT-STT e, se i relativi costi sono stati separati nei CdC 162 e 163, nemmeno quelle degli ospiti ",null,null,"    SPOSTATI (aggregati) nei CdC principali"]
[12,"CespitiContabilitàInvestimenti ","Giornale degli investimenti ",null,null,"dei reparti di cure palliative e/o del reparto Alzheimer, in quanto questo foglio considera solo i costi ",null,null,"   - sfondo celeste: CdC da delimitare, ossia i cui costi devono essere tralasciati per SOMED, poiché la Statistica "]
[13,"Resoconti COIN ","Riassunti della COIN per UACD e per SOMED nonché programma ",null,null,"dei CdC principali, senza includere i costi dei servizi annessi.",null,null,"    SOMED-A non considera questo tipo di attività come facente parte dell'attività dell'istituto. Per DELIMITARE i costi"]
[null,null,"per creare il file di esportazione con i dati COIN per SOMED-A Online (E4)",null,null,null,null,null,"     dei CdC con sfondo celeste è possibile utilizzare il pulsante AGGIORNA DELIMITAZIONI. "]
[null,null,null,null,"Da ultimo occorre allestire la contabilità per SOMED. Si tratta in particolare : "]
[null,null,null,null,null,"- di spostare i costi di alcuni servizi annessi e delle voci non finanziate nei centri di costo generali e/o principali",null,"AD","Il pulsante AGGIORNA DELIMITAZIONI trasferisce, sommandoli agli importi già presenti, tutti gli "]
["Stampa dei fogli ",null,null,null,null,"- di delimitare (escludere) i centri di costo che per definizione esulano da SOMED (in particolare CdC annessi",null,null,"importi delle celle celesti nella colonna D delle delimitazioni. Inoltre azzera le celle celesti."]
["Le stampe sono impostate per il formato A3. Talvolta le formattazioni per la stampa sono cancellate",null,null,null,null,"   quali appartamenti protetti, ambulatorio medico, come pure TUTTE le gestioni estranee e straordinarie)."]
["quando il file viene trasmesso e potrebbe essere necessario reimpostarle tutte. ",null,null,null,"I fogli SOMED sono stati programmati affinché un massimo di queste operazioni vengano effettuate automaticamente. ",null,null,null,"A questo punto occorre SPOSTARE a mano i costi dei CdC che non sono considerati servizi annessi in SOMED"]
[null,null,null,null,"Alcune operazioni devono però essere completate a mano. ",null,null,null,"(celle con sfondo violetto). "]
[null,null,null,null,null,null,null,null,"Gli importi nelle celle violette vanno spostati a mano, sommandoli (nella stessa riga) sotto il CdC principale"]
[null,null,null,null,6,"Foglio \"Ripartizioni\":  dati per SOMED ",null,null,"(o CdC generale) che ha generato l'importo, e togliendoli dalle celle con sfondo violetto (azzerandole). "]
[null,null,null,null,null,"La \"Tab 2B\" del foglio \"Ripartizioni\" contiene i pesi per SOMED, calcolati a partire dai pesi per la COAN per UACD. "]
[null,null,null,null,null,"Poiché il questionario SOMED-A non prevede alcuni dei servizi annessi quali CdC a sé stanti, occorre inserire",null,null,"Al termine dei procedimenti di DELIMITAZIONE e SPOSTAMENTO, tutte le celle con sfondo violetto "]
[null,null,null,null,null,"detti servizi annessi all'interno dei CdC principali. ",null,null,"o celeste devono contenere degli zeri o essere vuote. "]
[null,null,null,null,null,"L'ultima colonna a destra della \"Tab. 2B\" permette di verificare se le riattribuzioni dei pesi sono corrette, ovvero  "]
[null,null,null,null,null,"se i pesi nella \"Tab. 2B\" sommati ai pesi tralasciati da essa (delimitati) danno lo stesso totale della \"Tab. 2A\". ",null,"(RI)","A questo punto la contabilità analitica per CDC ai fine della SOMED è terminata. Se si dovessero riscontrare "]
[null,null,null,null,null,null,null,null,"problemi nelle ripartizioni (segnali di errore nelle righe 47-57 di questo foglio) potrebbe essere necessario"]
[null,null,null,null,"RI","Nella parte bassa del foglio \"Ripartizioni\" (per SOMED) si trova anche il pulsante RESET ITERAZIONI. ",null,null,"lanciare il programma (pulsante) RESET ITERAZIONI che si trova nel foglio \"Ripartizioni\"."]
[null,null,null,null,null,"Questo programma deve essere lanciato quando nella \"Tab. 2B\" (e nel fogli \"Contabilità per CdC\") appaiono dei"]
[null,null,null,null,null," segnali di errore, in particolare le divisioni per zero. Le formule per calcolare le ripartizioni sono formule Excel ",null,8,"Foglio \"Contabilità per UFI - SOMED\" "]
[null,null,null,null,null,"iterative, e talvolta, vista la complessità del file, queste iterazioni si bloccano e i calcoli non vengono eseguiti ",null,null,"Il foglio \"Contabilità per UFI - SOMED\" serve a compilare tutti i capitoli della parte contabile inerenti alla Stastistica"]
[null,null,null,null,null,"correttamente. Con il pulsante si rilanciano le formule. ",null,null,"SOMED-A, salvo la parte degli investimenti. Esso è quasi totalmente automatizzato, infatti le celle (bianche) da"]
[null,null,null,null,null,null,null,null,"compilare sono poche. I dati sono ripresi praticamente tutti dal foglio \"Contabilità per CDC - SOMED\". "]
[null,null,null,null,7,"Foglio \"Contabilità per CDC - SOMED\"",null,null,"Per la Statistica SOMED-A, sia il contributo globale annuo di gestione erogato alla CPA, sia per il Reparto CAT-STT,"]
[null,null,null,null,null,"Quando le ripartizioni e la contabilità degli investimenti sono sistemate, è possibile passare al foglio ",null,null,"sono stimati in base all'ipotesi di un PAREGGIO D'ESERCIZIO. A questo scopo, i calcoli sono eseguiti nella zona con"]
[null,null,null,null,null,"\"Contabilità per CDC - SOMED\". Per compilare questa parte occorre lanciare i tre programmi previsti nel foglio",null,null," sfondo celeste e, in seguito, i risultati inscritti nella parte SOMED."]
[null,null,null,null,null,"nel seguente ordine: ",null,null,"Dopo avere terminato i controlli, è possibile usare il pulsante per creare il file di esportazione dati per la Statistica"]
[null,null,null,null,null,null,null,null,"SOMED-A Online. "]

{"sheet":"COAN Verifica","index":2,"n_rows":79,"n_cols":4,"rows_kept":79,"cut":false,"hidden":false,"merged":[[78,0,78,1]]}
["Verifica di attendibilità"]
[{"$f":"Parametri!$B$7","v":2021},{"$f":"Parametri!$B$3","v":"ESEMPIO - CPA STANDARD CON CAT-STT"}]
[]
[]
[null,"Voci di costo","Il totale dei costi è ripartito correttamente"]
[null,null," sulle voci di costo?"]
[{"$f":"'Contabilità per CDC - UACD'!A9","v":3000},{"$f":"'Contabilità per CDC - UACD'!B9","v":"Salari medici"},{"$f":"IF(ABS('Contabilità per CDC - UACD'!E9-'Contabilità per CDC - UACD'!Q9-'Contabilità per CDC - UACD'!AA9-'Contabilità per CDC - UACD'!AP9-'Contabilità per CDC - UACD'!AR9-'Contabilità per CDC - UACD'!AU9-'Contabilità per CDC - UACD'!BF9-'Contabilità per CDC - UACD'!BH9)<=0.01,\"OK\",\"\")","v":"OK"},{"$f":"IF(C7=\"OK\",\"\",\"Errore\")","v":""}]
[{"$f":"'Contabilità per CDC - UACD'!A10","v":3001},{"$f":"'Contabilità per CDC - UACD'!B10","v":"Salari responsabili di struttura"},{"$f":"IF(ABS('Contabilità per CDC - UACD'!E10-'Contabilità per CDC - UACD'!Q10-'Contabilità per CDC - UACD'!AA10-'Contabilità per CDC - UACD'!AP10-'Contabilità per CDC - UACD'!AR10-'Contabilità per CDC - UACD'!AU10-'Contabilità per CDC - UACD'!BF10-'Contabilità per CDC - UACD'!BH10)<=0.01,\"OK\",\"\")","v":"OK"},{"$f":"IF(C8=\"OK\",\"\",\"Errore\")","v":""}]
[{"$f":"'Contabilità per CDC - UACD'!A11","v":3001.05},{"$f":"'Contabilità per CDC - UACD'!B11","v":"Salari capi reparto"},{"$f":"IF(ABS('Contabilità per CDC - UACD'!E11-'Contabilità per CDC - UACD'!Q11-'Contabilità per CDC - UACD'!AA11-'Contabilità per CDC - UACD'!AP11-'Contabilità per CDC - UACD'!AR11-'Contabilità per CDC - UACD'!AU11-'Contabilità per CDC - UACD'!BF11-'Contabilità per CDC - UACD'!BH11)<=0.01,\"OK\",\"\")","v":"OK"},""]
[{"$f":"'Contabilità per CDC - UACD'!A12","v":3001.1},{"$f":"'Contabilità per CDC - UACD'!B12","v":"Salari infermieri e operatori socio sanitari (OSS)"},{"$f":"IF(ABS('Contabilità per CDC - UACD'!E12-'Contabilità per CDC - UACD'!Q12-'Contabilità per CDC - UACD'!AA12-'Contabilità per CDC - UACD'!AP12-'Contabilità per CDC - UACD'!AR12-'Contabilità per CDC - UACD'!AU12-'Contabilità per CDC - UACD'!BF12-'Contabilità per CDC - UACD'!BH12)<=0.01,\"OK\",\"\")","v":"OK"},""]
[{"$f":"'Contabilità per CDC - UACD'!A13","v":3001.2},{"$f":"'Contabilità per CDC - UACD'!B13","v":"Salari assistenti e ausiliari di cura"},{"$f":"IF(ABS('Contabilità per CDC - UACD'!E13-'Contabilità per CDC - UACD'!Q13-'Contabilità per CDC - UACD'!AA13-'Contabilità per CDC - UACD'!AP13-'Contabilità per CDC - UACD'!AR13-'Contabilità per CDC - UACD'!AU13-'Contabilità per CDC - UACD'!BF13-'Contabilità per CDC - UACD'!BH13)<=0.01,\"OK\",\"\")","v":"OK"},""]
[{"$f":"'Contabilità per CDC - UACD'!A14","v":3001.3},{"$f":"'Contabilità per CDC - UACD'!B14","v":"Salari dietisti"},{"$f":"IF(ABS('Contabilità per CDC - UACD'!E14-'Contabilità per CDC - UACD'!Q14-'Contabilità per CDC - UACD'!AA14-'Contabilità per CDC - UACD'!AP14-'Contabilità per CDC - UACD'!AR14-'Contabilità per CDC - UACD'!AU14-'Contabilità per CDC - UACD'!BF14-'Contabilità per CDC - UACD'!BH14)<=0.01,\"OK\",\"\")","v":"OK"},{"$f":"IF(C12=\"OK\",\"\",\"Errore\")","v":""}]
[{"$f":"'Contabilità per CDC - UACD'!A15","v":3001.9},{"$f":"'Contabilità per CDC - UACD'!B15","v":"Salari personale di cura in formazione e stagisti"},{"$f":"IF(ABS('Contabilità per CDC - UACD'!E15-'Contabilità per CDC - UACD'!Q15-'Contabilità per CDC - UACD'!AA15-'Contabilità per CDC - UACD'!AP15-'Contabilità per CDC - UACD'!AR15-'Contabilità per CDC - UACD'!AU15-'Contabilità per CDC - UACD'!BF15-'Contabilità per CDC - UACD'!BH15)<=0.01,\"OK\",\"\")","v":"OK"},""]
[{"$f":"'Contabilità per CDC - UACD'!A16","v":3002},{"$f":"'Contabilità per CDC - UACD'!B16","v":"Salari personale altre discipline mediche specializzate"},{"$f":"IF(ABS('Contabilità per CDC - UACD'!E16-'Contabilità per CDC - UACD'!Q16-'Contabilità per CDC - UACD'!AA16-'Contabilità per CDC - UACD'!AP16-'Contabilità per CDC - UACD'!AR16-'Contabilità per CDC - UACD'!AU16-'Contabilità per CDC - UACD'!BF16-'Contabilità per CDC - UACD'!BH16)<=0.01,\"OK\",\"\")","v":"OK"},""]
[{"$f":"'Contabilità per CDC - UACD'!A17","v":3003},{"$f":"'Contabilità per CDC - UACD'!B17","v":"Salari personale amministrativo"},{"$f":"IF(ABS('Contabilità per CDC - UACD'!E17-'Contabilità per CDC - UACD'!Q17-'Contabilità per CDC - UACD'!AA17-'Contabilità per CDC - UACD'!AP17-'Contabilità per CDC - UACD'!AR17-'Contabilità per CDC - UACD'!AU17-'Contabilità per CDC - UACD'!BF17-'Contabilità per CDC - UACD'!BH17)<=0.01,\"OK\",\"\")","v":"OK"},""]
[{"$f":"'Contabilità per CDC - UACD'!A18","v":3004},{"$f":"'Contabilità per CDC - UACD'!B18","v":"Salari personale servizio alberghiero"},{"$f":"IF(ABS('Contabilità per CDC - UACD'!E18-'Contabilità per CDC - UACD'!Q18-'Contabilità per CDC - UACD'!AA18-'Contabilità per CDC - UACD'!AP18-'Contabilità per CDC - UACD'!AR18-'Contabilità per CDC - UACD'!AU18-'Contabilità per CDC - UACD'!BF18-'Contabilità per CDC - UACD'!BH18)<=0.01,\"OK\",\"\")","v":"OK"},""]
[{"$f":"'Contabilità per CDC - UACD'!A19","v":3005},{"$f":"'Contabilità per CDC - UACD'!B19","v":"Salari personale servizio tecnico"},{"$f":"IF(ABS('Contabilità per CDC - UACD'!E19-'Contabilità per CDC - UACD'!Q19-'Contabilità per CDC - UACD'!AA19-'Contabilità per CDC - UACD'!AP19-'Contabilità per CDC - UACD'!AR19-'Contabilità per CDC - UACD'!AU19-'Contabilità per CDC - UACD'!BF19-'Contabilità per CDC - UACD'!BH19)<=0.01,\"OK\",\"\")","v":"OK"},""]
[{"$f":"'Contabilità per CDC - UACD'!A20","v":3009},{"$f":"'Contabilità per CDC - UACD'!B20","v":"Prestazioni continuative da parte di personale esterno"},{"$f":"IF(ABS('Contabilità per CDC - UACD'!E20-'Contabilità per CDC - UACD'!Q20-'Contabilità per CDC - UACD'!AA20-'Contabilità per CDC - UACD'!AP20-'Contabilità per CDC - UACD'!AR20-'Contabilità per CDC - UACD'!AU20-'Contabilità per CDC - UACD'!BF20-'Contabilità per CDC - UACD'!BH20)<=0.01,\"OK\",\"\")","v":"OK"},""]
[{"$f":"'Contabilità per CDC - UACD'!A21","v":309},{"$f":"'Contabilità per CDC - UACD'!B21","v":"Messa a disposizione di personale a terzi"},{"$f":"IF(ABS('Contabilità per CDC - UACD'!E21-'Contabilità per CDC - UACD'!Q21-'Contabilità per CDC - UACD'!AA21-'Contabilità per CDC - UACD'!AP21-'Contabilità per CDC - UACD'!AR21-'Contabilità per CDC - UACD'!AU21-'Contabilità per CDC - UACD'!BF21-'Contabilità per CDC - UACD'!BH21)<=0.01,\"OK\",\"\")","v":"OK"},""]
[{"$f":"'Contabilità per CDC - UACD'!A22","v":37},{"$f":"'Contabilità per CDC - UACD'!B22","v":"Oneri sociali"},{"$f":"IF(ABS('Contabilità per CDC - UACD'!E22-'Contabilità per CDC - UACD'!Q22-'Contabilità per CDC - UACD'!AA22-'Contabilità per CDC - UACD'!AP22-'Contabilità per CDC - UACD'!AR22-'Contabilità per CDC - UACD'!AU22-'Contabilità per CDC - UACD'!BF22-'Contabilità per CDC - UACD'!BH22)<=0.01,\"OK\",\"\")","v":"OK"},""]
[null,{"$f":"'Contabilità per CDC - UACD'!B23","v":"Neutralizzazione cassa pensione"},{"$f":"IF(ABS('Contabilità per CDC - UACD'!E23-'Contabilità per CDC - UACD'!Q23-'Contabilità per CDC - UACD'!AA23-'Contabilità per CDC - UACD'!AP23-'Contabilità per CDC - UACD'!AR23-'Contabilità per CDC - UACD'!AU23-'Contabilità per CDC - UACD'!BF23-'Contabilità per CDC - UACD'!BH23)<=0.01,\"OK\",\"\")","v":"OK"},{"$f":"IF(C21=\"OK\",\"\",\"Errore\")","v":""}]
[{"$f":"'Contabilità per CDC - UACD'!A24","v":38},{"$f":"'Contabilità per CDC - UACD'!B24","v":"Onorari medici"},{"$f":"IF(ABS('Contabilità per CDC - UACD'!E24-'Contabilità per CDC - UACD'!Q24-'Contabilità per CDC - UACD'!AA24-'Contabilità per CDC - UACD'!AP24-'Contabilità per CDC - UACD'!AR24-'Contabilità per CDC - UACD'!AU24-'Contabilità per CDC - UACD'!BF24-'Contabilità per CDC - UACD'!BH24)<=0.01,\"OK\",\"\")","v":"OK"},""]
[{"$f":"'Contabilità per CDC - UACD'!A25","v":39},{"$f":"'Contabilità per CDC - UACD'!B25","v":"Altri costi del personale"},{"$f":"IF(ABS('Contabilità per CDC - UACD'!E25-'Contabilità per CDC - UACD'!Q25-'Contabilità per CDC - UACD'!AA25-'Contabilità per CDC - UACD'!AP25-'Contabilità per CDC - UACD'!AR25-'Contabilità per CDC - UACD'!AU25-'Contabilità per CDC - UACD'!BF25-'Contabilità per CDC - UACD'!BH25)<=0.01,\"OK\",\"\")","v":"OK"},""]
[{"$f":"'Contabilità per CDC - UACD'!A26","v":40},{"$f":"'Contabilità per CDC - UACD'!B26","v":"Fabbisogno medico"},{"$f":"IF(ABS('Contabilità per CDC - UACD'!E26-'Contabilità per CDC - UACD'!Q26-'Contabilità per CDC - UACD'!AA26-'Contabilità per CDC - UACD'!AP26-'Contabilità per CDC - UACD'!AR26-'Contabilità per CDC - UACD'!AU26-'Contabilità per CDC - UACD'!BF26-'Contabilità per CDC - UACD'!BH26)<=0.01,\"OK\",\"\")","v":"OK"},""]
[{"$f":"'Contabilità per CDC - UACD'!A27","v":41},{"$f":"'Contabilità per CDC - UACD'!B27","v":"Costi dei generi alimentari"},{"$f":"IF(ABS('Contabilità per CDC - UACD'!E27-'Contabilità per CDC - UACD'!Q27-'Contabilità per CDC - UACD'!AA27-'Contabilità per CDC - UACD'!AP27-'Contabilità per CDC - UACD'!AR27-'Contabilità per CDC - UACD'!AU27-'Contabilità per CDC - UACD'!BF27-'Contabilità per CDC - UACD'!BH27)<=0.01,\"OK\",\"\")","v":"OK"},""]
[{"$f":"'Contabilità per CDC - UACD'!A28","v":42},{"$f":"'Contabilità per CDC - UACD'!B28","v":"Costi di economia domestica"},{"$f":"IF(ABS('Contabilità per CDC - UACD'!E28-'Contabilità per CDC - UACD'!Q28-'Contabilità per CDC - UACD'!AA28-'Contabilità per CDC - UACD'!AP28-'Contabilità per CDC - UACD'!AR28-'Contabilità per CDC - UACD'!AU28-'Contabilità per CDC - UACD'!BF28-'Contabilità per CDC - UACD'!BH28)<=0.01,\"OK\",\"\")","v":"OK"},""]
[{"$f":"'Contabilità per CDC - UACD'!A29","v":43},{"$f":"'Contabilità per CDC - UACD'!B29","v":"Manutenzione e riparazione"},{"$f":"IF(ABS('Contabilità per CDC - UACD'!E29-'Contabilità per CDC - UACD'!Q29-'Contabilità per CDC - UACD'!AA29-'Contabilità per CDC - UACD'!AP29-'Contabilità per CDC - UACD'!AR29-'Contabilità per CDC - UACD'!AU29-'Contabilità per CDC - UACD'!BF29-'Contabilità per CDC - UACD'!BH29)<=0.01,\"OK\",\"\")","v":"OK"},""]
[{"$f":"'Contabilità per CDC - UACD'!A30","v":440},{"$f":"'Contabilità per CDC - UACD'!B30","v":"Investimenti inferiori al limite di attivazione COAN"},{"$f":"IF(ABS('Contabilità per CDC - UACD'!E30-'Contabilità per CDC - UACD'!Q30-'Contabilità per CDC - UACD'!AA30-'Contabilità per CDC - UACD'!AP30-'Contabilità per CDC - UACD'!AR30-'Contabilità per CDC - UACD'!AU30-'Contabilità per CDC - UACD'!BF30-'Contabilità per CDC - UACD'!BH30)<=0.01,\"OK\",\"\")","v":"OK"},""]
[{"$f":"'Contabilità per CDC - UACD'!A31","v":442},{"$f":"'Contabilità per CDC - UACD'!B31","v":"Ammortamenti"},{"$f":"IF(ABS('Contabilità per CDC - UACD'!E31-'Contabilità per CDC - UACD'!Q31-'Contabilità per CDC - UACD'!AA31-'Contabilità per CDC - UACD'!AP31-'Contabilità per CDC - UACD'!AR31-'Contabilità per CDC - UACD'!AU31-'Contabilità per CDC - UACD'!BF31-'Contabilità per CDC - UACD'!BH31)<=0.01,\"OK\",\"\")","v":"OK"},{"$f":"IF(C29=\"OK\",\"\",\"Errore\")","v":""}]
[{"$f":"'Contabilità per CDC - UACD'!A32","v":443},{"$f":"'Contabilità per CDC - UACD'!B32","v":"Canoni di locaz. per immobilizzaz. <  limite di attivazione COAN"},{"$f":"IF(ABS('Contabilità per CDC - UACD'!E32-'Contabilità per CDC - UACD'!Q32-'Contabilità per CDC - UACD'!AA32-'Contabilità per CDC - UACD'!AP32-'Contabilità per CDC - UACD'!AR32-'Contabilità per CDC - UACD'!AU32-'Contabilità per CDC - UACD'!BF32-'Contabilità per CDC - UACD'!BH32)<=0.01,\"OK\",\"\")","v":"OK"},""]
[{"$f":"'Contabilità per CDC - UACD'!A33","v":444},{"$f":"'Contabilità per CDC - UACD'!B33","v":"Canoni di locaz. per immobilizzaz. >= limite di attivazione COAN"},{"$f":"IF(ABS('Contabilità per CDC - UACD'!E33-'Contabilità per CDC - UACD'!Q33-'Contabilità per CDC - UACD'!AA33-'Contabilità per CDC - UACD'!AP33-'Contabilità per CDC - UACD'!AR33-'Contabilità per CDC - UACD'!AU33-'Contabilità per CDC - UACD'!BF33-'Contabilità per CDC - UACD'!BH33)<=0.01,\"OK\",\"\")","v":"OK"},""]
[{"$f":"'Contabilità per CDC - UACD'!A34","v":448},{"$f":"'Contabilità per CDC - UACD'!B34","v":"Interessi calcolatori sull'attivo fisso"},{"$f":"IF(ABS('Contabilità per CDC - UACD'!E34-'Contabilità per CDC - UACD'!Q34-'Contabilità per CDC - UACD'!AA34-'Contabilità per CDC - UACD'!AP34-'Contabilità per CDC - UACD'!AR34-'Contabilità per CDC - UACD'!AU34-'Contabilità per CDC - UACD'!BF34-'Contabilità per CDC - UACD'!BH34)<=0.01,\"OK\",\"\")","v":"OK"},""]
[{"$f":"'Contabilità per CDC - UACD'!A35","v":45},{"$f":"'Contabilità per CDC - UACD'!B35","v":"Costi per energia e acqua"},{"$f":"IF(ABS('Contabilità per CDC - UACD'!E35-'Contabilità per CDC - UACD'!Q35-'Contabilità per CDC - UACD'!AA35-'Contabilità per CDC - UACD'!AP35-'Contabilità per CDC - UACD'!AR35-'Contabilità per CDC - UACD'!AU35-'Contabilità per CDC - UACD'!BF35-'Contabilità per CDC - UACD'!BH35)<=0.01,\"OK\",\"\")","v":"OK"},""]
[{"$f":"'Contabilità per CDC - UACD'!A36","v":46},{"$f":"'Contabilità per CDC - UACD'!B36","v":"Oneri finanziari"},{"$f":"IF(ABS('Contabilità per CDC - UACD'!E36-'Contabilità per CDC - UACD'!Q36-'Contabilità per CDC - UACD'!AA36-'Contabilità per CDC - UACD'!AP36-'Contabilità per CDC - UACD'!AR36-'Contabilità per CDC - UACD'!AU36-'Contabilità per CDC - UACD'!BF36-'Contabilità per CDC - UACD'!BH36)<=0.01,\"OK\",\"\")","v":"OK"},""]
[{"$f":"'Contabilità per CDC - UACD'!A37","v":47},{"$f":"'Contabilità per CDC - UACD'!B37","v":"Costi amministrativi e di informatica"},{"$f":"IF(ABS('Contabilità per CDC - UACD'!E37-'Contabilità per CDC - UACD'!Q37-'Contabilità per CDC - UACD'!AA37-'Contabilità per CDC - UACD'!AP37-'Contabilità per CDC - UACD'!AR37-'Contabilità per CDC - UACD'!AU37-'Contabilità per CDC - UACD'!BF37-'Contabilità per CDC - UACD'!BH37)<=0.01,\"OK\",\"\")","v":"OK"},""]
[{"$f":"'Contabilità per CDC - UACD'!A38","v":48},{"$f":"'Contabilità per CDC - UACD'!B38","v":"Altri costi relativi ai residenti"},{"$f":"IF(ABS('Contabilità per CDC - UACD'!E38-'Contabilità per CDC - UACD'!Q38-'Contabilità per CDC - UACD'!AA38-'Contabilità per CDC - UACD'!AP38-'Contabilità per CDC - UACD'!AR38-'Contabilità per CDC - UACD'!AU38-'Contabilità per CDC - UACD'!BF38-'Contabilità per CDC - UACD'!BH38)<=0.01,\"OK\",\"\")","v":"OK"},""]
[{"$f":"'Contabilità per CDC - UACD'!A39","v":49},{"$f":"'Contabilità per CDC - UACD'!B39","v":"Altri costi non relativi ai residenti"},{"$f":"IF(ABS('Contabilità per CDC - UACD'!E39-'Contabilità per CDC - UACD'!Q39-'Contabilità per CDC - UACD'!AA39-'Contabilità per CDC - UACD'!AP39-'Contabilità per CDC - UACD'!AR39-'Contabilità per CDC - UACD'!AU39-'Contabilità per CDC - UACD'!BF39-'Contabilità per CDC - UACD'!BH39)<=0.01,\"OK\",\"\")","v":"OK"},""]
[]
[{"$f":"'Contabilità per CDC - UACD'!A42","v":65},{"$f":"'Contabilità per CDC - UACD'!B42","v":"Altri ricavi da prestazioni ai residenti"},{"$f":"IF(ABS('Contabilità per CDC - UACD'!E42-'Contabilità per CDC - UACD'!Q42-'Contabilità per CDC - UACD'!AA42-'Contabilità per CDC - UACD'!AP42-'Contabilità per CDC - UACD'!AR42-'Contabilità per CDC - UACD'!AU42-'Contabilità per CDC - UACD'!BF42-'Contabilità per CDC - UACD'!BH42)<=0.01,\"OK\",\"\")","v":"OK"},""]
[{"$f":"'Contabilità per CDC - UACD'!A43","v":66},{"$f":"'Contabilità per CDC - UACD'!B43","v":"Ricavi finanziari"},{"$f":"IF(ABS('Contabilità per CDC - UACD'!E43-'Contabilità per CDC - UACD'!Q43-'Contabilità per CDC - UACD'!AA43-'Contabilità per CDC - UACD'!AP43-'Contabilità per CDC - UACD'!AR43-'Contabilità per CDC - UACD'!AU43-'Contabilità per CDC - UACD'!BF43-'Contabilità per CDC - UACD'!BH43)<=0.01,\"OK\",\"\")","v":"OK"},""]
[{"$f":"'Contabilità per CDC - UACD'!A44","v":68},{"$f":"'Contabilità per CDC - UACD'!B44","v":"Ricavi da prestazioni fornite al personale e a terzi"},{"$f":"IF(ABS('Contabilità per CDC - UACD'!E44-'Contabilità per CDC - UACD'!Q44-'Contabilità per CDC - UACD'!AA44-'Contabilità per CDC - UACD'!AP44-'Contabilità per CDC - UACD'!AR44-'Contabilità per CDC - UACD'!AU44-'Contabilità per CDC - UACD'!BF44-'Contabilità per CDC - UACD'!BH44)<=0.01,\"OK\",\"\")","v":"OK"},""]
[{"$f":"'Contabilità per CDC - UACD'!A45","v":7},{"$f":"'Contabilità per CDC - UACD'!B45","v":"Imposte, risultato estraneo all'esercizio e straordinario"},{"$f":"IF(ABS('Contabilità per CDC - UACD'!E45-'Contabilità per CDC - UACD'!Q45-'Contabilità per CDC - UACD'!AA45-'Contabilità per CDC - UACD'!AP45-'Contabilità per CDC - UACD'!AR45-'Contabilità per CDC - UACD'!AU45-'Contabilità per CDC - UACD'!BF45-'Contabilità per CDC - UACD'!BH45)<=0.01,\"OK\",\"\")","v":"OK"},""]
[]
[{"$f":"'Contabilità per CDC - UACD'!A62","v":6000},{"$f":"'Contabilità per CDC - UACD'!B62","v":"Rette - Anziani"},{"$f":"IF(ABS('Contabilità per CDC - UACD'!E62-'Contabilità per CDC - UACD'!Q62-'Contabilità per CDC - UACD'!AA62-'Contabilità per CDC - UACD'!AP62-'Contabilità per CDC - UACD'!AR62-'Contabilità per CDC - UACD'!AU62-'Contabilità per CDC - UACD'!BF62-'Contabilità per CDC - UACD'!BH62)<=0.01,\"OK\",\"\")","v":"OK"},""]
[{"$f":"'Contabilità per CDC - UACD'!A63","v":6001},{"$f":"'Contabilità per CDC - UACD'!B63","v":"Partecipazioni delle casse malati"},{"$f":"IF(ABS('Contabilità per CDC - UACD'!E63-'Contabilità per CDC - UACD'!Q63-'Contabilità per CDC - UACD'!AA63-'Contabilità per CDC - UACD'!AP63-'Contabilità per CDC - UACD'!AR63-'Contabilità per CDC - UACD'!AU63-'Contabilità per CDC - UACD'!BF63-'Contabilità per CDC - UACD'!BH63)<=0.01,\"OK\",\"\")","v":"OK"},""]
[{"$f":"'Contabilità per CDC - UACD'!A64","v":6002},{"$f":"'Contabilità per CDC - UACD'!B64","v":"Assegni grandi invalidi - Anziani"},{"$f":"IF(ABS('Contabilità per CDC - UACD'!E64-'Contabilità per CDC - UACD'!Q64-'Contabilità per CDC - UACD'!AA64-'Contabilità per CDC - UACD'!AP64-'Contabilità per CDC - UACD'!AR64-'Contabilità per CDC - UACD'!AU64-'Contabilità per CDC - UACD'!BF64-'Contabilità per CDC - UACD'!BH64)<=0.01,\"OK\",\"\")","v":"OK"},""]
[{"$f":"'Contabilità per CDC - UACD'!A65","v":6003},{"$f":"'Contabilità per CDC - UACD'!B65","v":"Altri ricavi - Anziani"},{"$f":"IF(ABS('Contabilità per CDC - UACD'!E65-'Contabilità per CDC - UACD'!Q65-'Contabilità per CDC - UACD'!AA65-'Contabilità per CDC - UACD'!AP65-'Contabilità per CDC - UACD'!AR65-'Contabilità per CDC - UACD'!AU65-'Contabilità per CDC - UACD'!BF65-'Contabilità per CDC - UACD'!BH65)<=0.01,\"OK\",\"\")","v":"OK"},""]
[{"$f":"'Contabilità per CDC - UACD'!A66","v":601},{"$f":"'Contabilità per CDC - UACD'!B66","v":"Altri ricavi - Settore di attività n"},{"$f":"IF(ABS('Contabilità per CDC - UACD'!E66-'Contabilità per CDC - UACD'!Q66-'Contabilità per CDC - UACD'!AA66-'Contabilità per CDC - UACD'!AP66-'Contabilità per CDC - UACD'!AR66-'Contabilità per CDC - UACD'!AU66-'Contabilità per CDC - UACD'!BF66-'Contabilità per CDC - UACD'!BH66)<=0.01,\"OK\",\"\")","v":"OK"},""]
[{"$f":"'Contabilità per CDC - UACD'!A67","v":609},{"$f":"'Contabilità per CDC - UACD'!B67","v":"Diminuzioni dei ricavi relativi ai residenti"},{"$f":"IF(ABS('Contabilità per CDC - UACD'!E67-'Contabilità per CDC - UACD'!Q67-'Contabilità per CDC - UACD'!AA67-'Contabilità per CDC - UACD'!AP67-'Contabilità per CDC - UACD'!AR67-'Contabilità per CDC - UACD'!AU67-'Contabilità per CDC - UACD'!BF67-'Contabilità per CDC - UACD'!BH67)<=0.01,\"OK\",\"\")","v":"OK"},""]
[{"$f":"'Contabilità per CDC - UACD'!A68","v":61},{"$f":"'Contabilità per CDC - UACD'!B68","v":"Ricavi da prestazioni mediche singole"},{"$f":"IF(ABS('Contabilità per CDC - UACD'!E68-'Contabilità per CDC - UACD'!Q68-'Contabilità per CDC - UACD'!AA68-'Contabilità per CDC - UACD'!AP68-'Contabilità per CDC - UACD'!AR68-'Contabilità per CDC - UACD'!AU68-'Contabilità per CDC - UACD'!BF68-'Contabilità per CDC - UACD'!BH68)<=0.01,\"OK\",\"\")","v":"OK"},""]
[{"$f":"'Contabilità per CDC - UACD'!A69","v":62},{"$f":"'Contabilità per CDC - UACD'!B69","v":"Ricavi da prestazioni diagnostiche e terapeutiche singole"},{"$f":"IF(ABS('Contabilità per CDC - UACD'!E69-'Contabilità per CDC - UACD'!Q69-'Contabilità per CDC - UACD'!AA69-'Contabilità per CDC - UACD'!AP69-'Contabilità per CDC - UACD'!AR69-'Contabilità per CDC - UACD'!AU69-'Contabilità per CDC - UACD'!BF69-'Contabilità per CDC - UACD'!BH69)<=0.01,\"OK\",\"\")","v":"OK"},""]
[{"$f":"'Contabilità per CDC - UACD'!A70","v":69},{"$f":"'Contabilità per CDC - UACD'!B70","v":"Contributi e sussidi"},{"$f":"IF(ABS('Contabilità per CDC - UACD'!E70-'Contabilità per CDC - UACD'!Q70-'Contabilità per CDC - UACD'!AA70-'Contabilità per CDC - UACD'!AP70-'Contabilità per CDC - UACD'!AR70-'Contabilità per CDC - UACD'!AU70-'Contabilità per CDC - UACD'!BF70-'Contabilità per CDC - UACD'!BH70)<=0.01,\"OK\",\"\")","v":"OK"},""]
[]
[]
[]
[null,"Ripartizione dei centri di costo generali","I costi dei centri di costo generali"]
[null,null,"sono ripartiti correttamente?"]
[{"$f":"'Contabilità per CDC - UACD'!A48","v":"RIP010"},{"$f":"'Contabilità per CDC - UACD'!F7","v":"Edifici\n\n "},{"$f":"IF(ABS('Contabilità per CDC - UACD'!F$60)<0.01,\"OK\",\"\")","v":"OK"},{"$f":"IF(C58=\"OK\",\"\",\"Errore\")","v":""}]
[{"$f":"'Contabilità per CDC - UACD'!A49","v":"RIP011"},{"$f":"'Contabilità per CDC - UACD'!G7","v":"Energia"},{"$f":"IF(ABS('Contabilità per CDC - UACD'!G$60)<0.01,\"OK\",\"\")","v":"OK"},""]
[{"$f":"'Contabilità per CDC - UACD'!A50","v":"RIP020"},{"$f":"'Contabilità per CDC - UACD'!H7","v":"Servizio tecnico"},{"$f":"IF(ABS('Contabilità per CDC - UACD'!H$60)<0.01,\"OK\",\"\")","v":"OK"},""]
[{"$f":"'Contabilità per CDC - UACD'!A51","v":"RIP021"},{"$f":"'Contabilità per CDC - UACD'!I7","v":"Servizio trasporti"},{"$f":"IF(ABS('Contabilità per CDC - UACD'!I$60)<0.01,\"OK\",\"\")","v":"OK"},""]
[{"$f":"'Contabilità per CDC - UACD'!A52","v":"RIP030"},{"$f":"'Contabilità per CDC - UACD'!J7","v":"Direzione/\nAmministrazione"},{"$f":"IF(ABS('Contabilità per CDC - UACD'!J$60)<0.01,\"OK\",\"\")","v":"OK"},""]
[{"$f":"'Contabilità per CDC - UACD'!A53","v":"RIP040"},{"$f":"'Contabilità per CDC - UACD'!K7","v":"Economia domestica in generale"},{"$f":"IF(ABS('Contabilità per CDC - UACD'!K$60)<0.01,\"OK\",\"\")","v":"OK"},""]
[{"$f":"'Contabilità per CDC - UACD'!A54","v":"RIP041"},{"$f":"'Contabilità per CDC - UACD'!L7","v":"Lavanderia"},{"$f":"IF(ABS('Contabilità per CDC - UACD'!L$60)<0.01,\"OK\",\"\")","v":"OK"},""]
[{"$f":"'Contabilità per CDC - UACD'!A55","v":"RIP042"},{"$f":"'Contabilità per CDC - UACD'!M7","v":"Pulizia"},{"$f":"IF(ABS('Contabilità per CDC - UACD'!M$60)<0.01,\"OK\",\"\")","v":"OK"},""]
[{"$f":"'Contabilità per CDC - UACD'!A56","v":"RIP060"},{"$f":"'Contabilità per CDC - UACD'!N7","v":"Cucina"},{"$f":"IF(ABS('Contabilità per CDC - UACD'!N$60)<0.01,\"OK\",\"\")","v":"OK"},""]
[{"$f":"'Contabilità per CDC - UACD'!A57","v":"RIP090"},{"$f":"'Contabilità per CDC - UACD'!O7","v":"Magazzino centrale"},{"$f":"IF(ABS('Contabilità per CDC - UACD'!O$60)<0.01,\"OK\",\"\")","v":"OK"},""]
[{"$f":"'Contabilità per CDC - UACD'!A58","v":"RIP095"},{"$f":"'Contabilità per CDC - UACD'!P7","v":"Farmacia"},{"$f":"IF(ABS('Contabilità per CDC - UACD'!P$60)<0.01,\"OK\",\"\")","v":"OK"},""]
[]
[]
[]
[]
["I costi netti prima della ripartizione dei costi sono uguali a quelli dopo la ripartizione?",null,{"$f":"IF(ROUND('Contabilità per CDC - UACD'!E46-'Contabilità per CDC - UACD'!AA60-'Contabilità per CDC - UACD'!AP60-'Contabilità per CDC - UACD'!AR60-'Contabilità per CDC - UACD'!AU60-'Contabilità per CDC - UACD'!BF60-'Contabilità per CDC - UACD'!BH60,2)=0,\"OK\",\"\")","v":"OK"},{"$f":"IF(C73=\"OK\",\"\",\"Errore\")","v":""}]
[]
[]
[]
[]
[]
["Il totale dei centri di costo principali dopo la ripartizione corrisponde al totale delle unità finali d'imputazione della parte standard?",null,{"$f":"IF(ABS('Contabilità per CDC - UACD'!AA60-'Contabilità per UFI 1'!C59-'Contabilità per UFI 1'!D59-'Contabilità per UFI 1'!F59-'Contabilità per UFI 1'!H59-'Contabilità per UFI 1'!I59-'Contabilità per UFI 1'!J59-'Contabilità per UFI 1'!K59-'Contabilità per UFI 1'!L59-'Contabilità per UFI 1'!M59-'Contabilità per UFI 1'!N59)<0.01,\"OK\",\"\")","v":"OK"},{"$f":"IF(C79=\"OK\",\"\",\"Errore\")","v":""}]

{"sheet":"Ripartizioni","index":3,"n_rows":101,"n_cols":55,"rows_kept":101,"cut":false,"hidden":false,"merged":[[64,1,64,2],[65,1,65,2],[61,5,61,15],[61,16,61,24],[61,25,61,38],[61,40,61,41],[61,42,61,51],[28,5,28,15],[28,16,28,24],[28,25,28,38],[28,40,28,41],[28,42,28,51],[44,27,44,39],[72,5,72,15],[72,16,72,24],[72,25,72,38],[72,40,72,41],[72,42,72,51],[73,25,73,26],[74,25,74,26],[75,25,75,26],[76,25,76,26],[77,25,77,26],[83,25,83,26],[84,25,84,26],[85,25,85,26],[78,25,78,26],[79,25,79,26],[80,25,80,26],[81,25,81,26],[82,25,82,26]]}
["Ripartizioni"]
[{"$f":"Parametri!$B$7","v":2021},{"$f":"Parametri!$B$3","v":"ESEMPIO - CPA STANDARD CON CAT-STT"}]
["Tab. 1 - Criteri per la ripartizione dei costi dei centri di costo (CdC) generali"]
[null,"Centri di costo generali","Criterio per la ",null,"X = criterio ","   Commento "]
[null,null,"ripartizione",null,"scelto"]
["RIP010","Edifici","m2",null,"X",{"$f":"IF(E7=\"\",\"\",\"non compilare \")","v":""}]
[null,null," m3",null,null,{"$f":"IF(E6=\"x\",\"non compilare\",\"\")","v":"non compilare"}]
["RIP011","Energia","m2",null,"X",{"$f":"IF(E9=\"x\",\"non compilare\",\"\")","v":""}]
[null,null," m3",null,null,{"$f":"IF(E8=\"x\",\"non compilare\",\"\")","v":"non compilare"}]
["RIP020","Servizio tecnico","m2",null,"X",{"$f":"IF(E12=\"x\",\"non compilare\",IF(E11=\"\",\"\",\"non compilare\"))","v":""}]
[null,null,"m3",null,null,{"$f":"IF(E12=\"x\",\"non compilare\",IF(E10=\"x\",\"non compilare\",\"\"))","v":"non compilare"}]
[null,null,"rapporto orario",null,null,{"$f":"IF(E10=\"x\",\"non compilare\",IF(E11=\"\",\"\",\"non compilare\"))","v":"non compilare"}]
["RIP021","Servizio trasporti","km (a campione)",null,null,{"$f":"IF(E14=\"\",\"\",\"non compilare\")","v":"non compilare"}]
[null,null,"km (sistematico)",null,"X",{"$f":"IF(E13=\"x\",\"non compilare\",\"\")","v":""}]
["RIP030","Direzione/amministrazione","% retribuzione",null,"X"]
["RIP040","Economia domestica","% retribuzione",null,"X"]
["RIP041","Lavanderia","kg (a campione)",null,null,{"$f":"IF(E18=\"\",\"\",\"non compilare\")","v":"non compilare"}]
[null,null,"kg (sistematico)",null,"X",{"$f":"IF(E17=\"x\",\"non compilare\",\"\")","v":""}]
["RIP042","Pulizia","m2",null,"X",{"$f":"IF(E20=\"\",\"\",\"non compilare\")","v":""}]
[null,null,"rapporto orario",null,null,{"$f":"IF(E19=\"x\",\"non compilare\",\"\")","v":"non compilare"}]
["RIP060","Cucina","Giornate di cura (presenza)",null,null,{"$f":"IF(E22=\"\",\"\",\"non compilare\")","v":"non compilare"}]
[null,null,"Numero di pasti",null,"X",{"$f":"IF(E21=\"x\",\"non compilare\",\"\")","v":""}]
["RIP090","Magazzino centrale","Allocazione diretta",null,"X"]
["RIP095","Farmacia","Allocazione diretta",null,"X"]
[]
[]
[]
["Tab. 2A -  Ripartizioni per COAN UACD"]
[null,null,null,null,"Totale ","Centri di costo generali",null,null,null,null,null,null,null,null,null,null,"Centri di costo principali",null,null,null,null,null,null,null,null,"Servizi annessi",null,null,null,null,null,null,null,null,null,null,null,null,null,"Voci non riconosciute","Prestazioni all'atto",null,"Gestione estranea",null,null,null,null,null,null,null,null,null,"Gestione straordinaria"]
[null,"\nCentri di costo generali","Unità",null,"generale",{"$f":"'Contabilità per CDC - UACD'!F6","v":"010"},{"$f":"'Contabilità per CDC - UACD'!G6","v":"011"},{"$f":"'Contabilità per CDC - UACD'!H6","v":"020"},{"$f":"'Contabilità per CDC - UACD'!I6","v":"021"},{"$f":"'Contabilità per CDC - UACD'!J6","v":"030"},{"$f":"'Contabilità per CDC - UACD'!K6","v":"040"},{"$f":"'Contabilità per CDC - UACD'!L6","v":"041"},{"$f":"'Contabilità per CDC - UACD'!M6","v":"042"},{"$f":"'Contabilità per CDC - UACD'!N6","v":"060"},{"$f":"'Contabilità per CDC - UACD'!O6","v":"090"},{"$f":"'Contabilità per CDC - UACD'!P6","v":"095"},{"$f":"'Contabilità per CDC - UACD'!R6","v":"100"},{"$f":"'Contabilità per CDC - UACD'!S6","v":"110"},{"$f":"'Contabilità per CDC - UACD'!T6","v":"115"},{"$f":"'Contabilità per CDC - UACD'!U6","v":"130"},{"$f":"'Contabilità per CDC - UACD'!V6","v":"131"},{"$f":"'Contabilità per CDC - UACD'!W6","v":"132"},{"$f":"'Contabilità per CDC - UACD'!X6","v":"140"},{"$f":"'Contabilità per CDC - UACD'!Y6","v":"150"},{"$f":"'Contabilità per CDC - UACD'!Z6","v":"151"},{"$f":"'Contabilità per CDC - UACD'!AB6","v":160},{"$f":"'Contabilità per CDC - UACD'!AC6","v":161},{"$f":"'Contabilità per CDC - UACD'!AD6","v":162},{"$f":"'Contabilità per CDC - UACD'!AE6","v":163},{"$f":"'Contabilità per CDC - UACD'!AF6","v":"16X"},{"$f":"'Contabilità per CDC - UACD'!AG6","v":170},{"$f":"'Contabilità per CDC - UACD'!AH6","v":171},{"$f":"'Contabilità per CDC - UACD'!AI6","v":172},{"$f":"'Contabilità per CDC - UACD'!AJ6","v":"17X"},{"$f":"'Contabilità per CDC - UACD'!AK6","v":180},{"$f":"'Contabilità per CDC - UACD'!AL6","v":181},{"$f":"'Contabilità per CDC - UACD'!AM6","v":182},{"$f":"'Contabilità per CDC - UACD'!AN6","v":183},{"$f":"'Contabilità per CDC - UACD'!AO6","v":184},{"$f":"'Contabilità per CDC - UACD'!AQ6","v":190},{"$f":"'Contabilità per CDC - UACD'!AS6","v":800},{"$f":"'Contabilità per CDC - UACD'!AT6","v":"80x"},{"$f":"'Contabilità per CDC - UACD'!AV6","v":900},{"$f":"'Contabilità per CDC - UACD'!AW6","v":905},{"$f":"'Contabilità per CDC - UACD'!AX6","v":910},{"$f":"'Contabilità per CDC - UACD'!AY6","v":915},{"$f":"'Contabilità per CDC - UACD'!AZ6","v":920},{"$f":"'Contabilità per CDC - UACD'!BA6","v":925},{"$f":"'Contabilità per CDC - UACD'!BB6","v":930},{"$f":"'Contabilità per CDC - UACD'!BC6","v":935},{"$f":"'Contabilità per CDC - UACD'!BD6","v":940},{"$f":"'Contabilità per CDC - UACD'!BE6","v":945},{"$f":"'Contabilità per CDC - UACD'!BG6","v":990}]
[null,null,null,null,null,{"$f":"'Contabilità per CDC - UACD'!F7","v":"Edifici\n\n "},{"$f":"'Contabilità per CDC - UACD'!G7","v":"Energia"},{"$f":"'Contabilità per CDC - UACD'!H7","v":"Servizio tecnico"},{"$f":"'Contabilità per CDC - UACD'!I7","v":"Servizio trasporti"},{"$f":"'Contabilità per CDC - UACD'!J7","v":"Direzione/\nAmministrazione"},{"$f":"'Contabilità per CDC - UACD'!K7","v":"Economia domestica in generale"},{"$f":"'Contabilità per CDC - UACD'!L7","v":"Lavanderia"},{"$f":"'Contabilità per CDC - UACD'!M7","v":"Pulizia"},{"$f":"'Contabilità per CDC - UACD'!N7","v":"Cucina"},{"$f":"'Contabilità per CDC - UACD'!O7","v":"Magazzino centrale"},{"$f":"'Contabilità per CDC - UACD'!P7","v":"Farmacia"},{"$f":"'Contabilità per CDC - UACD'!R7","v":"Servizio alberghiero"},{"$f":"'Contabilità per CDC - UACD'!S7","v":"Animazione  "},{"$f":"'Contabilità per CDC - UACD'!T7","v":"Cura                    "},{"$f":"'Contabilità per CDC - UACD'!U7","v":"Fisioterapia"},{"$f":"'Contabilità per CDC - UACD'!V7","v":"Ergoterapia                  "},{"$f":"'Contabilità per CDC - UACD'!W7","v":"Altre consulenze e terapie"},{"$f":"'Contabilità per CDC - UACD'!X7","v":"Servizio medico                         "},{"$f":"'Contabilità per CDC - UACD'!Y7","v":"Materiale\nsecondo EMAp"},{"$f":"'Contabilità per CDC - UACD'!Z7","v":"Medicamenti secondo ES / EMT"},{"$f":"'Contabilità per CDC - UACD'!AB7","v":"CAT"},{"$f":"'Contabilità per CDC - UACD'!AC7","v":"STT\n> NON COMPILARE !"},{"$f":"'Contabilità per CDC - UACD'!AD7","v":"Cure palliative"},{"$f":"'Contabilità per CDC - UACD'!AE7","v":"Reparto Alzheimer"},{"$f":"'Contabilità per CDC - UACD'!AF7","v":"STAZ n"},{"$f":"'Contabilità per CDC - UACD'!AG7","v":"Ambulatorio medico"},{"$f":"'Contabilità per CDC - UACD'!AH7","v":"Centro diurno terapeutico (CDT)"},{"$f":"'Contabilità per CDC - UACD'!AI7","v":"Appartamenti protetti"},{"$f":"'Contabilità per CDC - UACD'!AJ7","v":"AMB n\n(CD socio-assistenziale, ecc.)"},{"$f":"'Contabilità per CDC - UACD'!AK7","v":"Altre voci riconosciute\n(oneri ipotecari\ne affitti)"},{"$f":"'Contabilità per CDC - UACD'!AL7","v":"Altre voci riconosciute (formazione apprendisti, stagiaires e ausiliari)"},{"$f":"'Contabilità per CDC - UACD'!AM7","v":"Altre voci riconosciute\n(neutralizzazione cassa pensione)"},{"$f":"'Contabilità per CDC - UACD'!AN7","v":"Altre voci riconosciute\n(contributi straordinari)"},{"$f":"'Contabilità per CDC - UACD'!AO7","v":"Altre voci riconosciute\n(Spese COVID-19\nAnno 2021)"},{"$f":"'Contabilità per CDC - UACD'!AQ7","v":"Voci\nnon riconosciute"},"Gestione MEDICAMENTI\ne materiale all'atto","Gestione TERAPIE all'atto\n(fisio-, ergoterapia, altre terapie)\nn",{"$f":"'Contabilità per CDC - UACD'!AV7","v":"Appartamenti\nper il personale"},{"$f":"'Contabilità per CDC - UACD'!AW7","v":"Bar e ristorante"},{"$f":"'Contabilità per CDC - UACD'!AX7","v":"Edicola"},{"$f":"'Contabilità per CDC - UACD'!AY7","v":"Negozio"},{"$f":"'Contabilità per CDC - UACD'!AZ7","v":"Parrucchiere"},{"$f":"'Contabilità per CDC - UACD'!BA7","v":"Pedicure"},{"$f":"'Contabilità per CDC - UACD'!BB7","v":"Posteggi"},{"$f":"'Contabilità per CDC - UACD'!BC7","v":"Prestazioni di lavanderia a terzi"},{"$f":"'Contabilità per CDC - UACD'!BD7","v":"Vendita di pasti\na terzi"},{"$f":"'Contabilità per CDC - UACD'!BE7","v":"ESTR n"},{"$f":"'Contabilità per CDC - UACD'!BG7","v":"Gestione straordinaria"}]
["RIP010",{"$f":"F31","v":"Edifici\n\n "},{"$f":"IF(E$6=\"x\",C$6,C$7)","v":"m2"},null,{"$f":"SUM(F32:BA32)","v":4590},null,75,50,null,100,80,100,45,320,null,null,2500,120,100,20,25,null,null,null,null,850,null,null,null,null,null,null,null,null,null,null,null,null,null,null,10,45,null,150]
["RIP011",{"$f":"G31","v":"Energia"},{"$f":"IF(E$8=\"x\",C$8,C$9)","v":"m2"},null,{"$f":"SUM(F33:BA33)","v":4515},null,null,50,null,100,80,100,45,320,null,null,2500,120,100,20,25,null,null,null,null,850,null,null,null,null,null,null,null,null,null,null,null,null,null,null,10,45,null,150]
["RIP020",{"$f":"H31","v":"Servizio tecnico"},{"$f":"IF(E$10=\"x\",C$10,IF(E$11=\"x\",C$11,C$12))","v":"m2"},null,{"$f":"SUM(F34:BA34)","v":4540},null,75,null,null,100,80,100,45,320,null,null,2500,120,100,20,25,null,null,null,null,850,null,null,null,null,null,null,null,null,null,null,null,null,null,null,10,45,null,150]
["RIP021",{"$f":"I31","v":"Servizio trasporti"},{"$f":"IF(E$13=\"x\",C$13,C$14)","v":"km (sistematico)"},null,{"$f":"SUM(F35:BA35)","v":1900},null,null,100,null,1100,null,null,null,50,null,null,null,150,500]
["RIP030",{"$f":"J31","v":"Direzione/\nAmministrazione"},{"$f":"C15","v":"% retribuzione"},null,{"$f":"SUM(F36:BA36)","v":0.92702957565366495},{"$f":"IF(SUM('Contabilità per CDC - UACD'!F9:F21)=0,0,(SUM('Contabilità per CDC - UACD'!F9:F21)/SUM('Contabilità per CDC - UACD'!$E$9:$E$21)))","v":0},{"$f":"IF(SUM('Contabilità per CDC - UACD'!G9:G21)=0,0,(SUM('Contabilità per CDC - UACD'!G9:G21)/SUM('Contabilità per CDC - UACD'!$E$9:$E$21)))","v":0},{"$f":"IF(SUM('Contabilità per CDC - UACD'!H9:H21)=0,0,(SUM('Contabilità per CDC - UACD'!H9:H21)/SUM('Contabilità per CDC - UACD'!$E$9:$E$21)))","v":1.1830261465923704E-2},{"$f":"IF(SUM('Contabilità per CDC - UACD'!I9:I21)=0,0,(SUM('Contabilità per CDC - UACD'!I9:I21)/SUM('Contabilità per CDC - UACD'!$E$9:$E$21)))","v":0},null,{"$f":"IF(SUM('Contabilità per CDC - UACD'!K9:K21)=0,0,(SUM('Contabilità per CDC - UACD'!K9:K21)/SUM('Contabilità per CDC - UACD'!$E$9:$E$21)))","v":9.4299185597942568E-3},{"$f":"IF(SUM('Contabilità per CDC - UACD'!L9:L21)=0,0,(SUM('Contabilità per CDC - UACD'!L9:L21)/SUM('Contabilità per CDC - UACD'!$E$9:$E$21)))","v":4.6720960137162454E-2},{"$f":"IF(SUM('Contabilità per CDC - UACD'!M9:M21)=0,0,(SUM('Contabilità per CDC - UACD'!M9:M21)/SUM('Contabilità per CDC - UACD'!$E$9:$E$21)))","v":4.4149164166309471E-2},{"$f":"IF(SUM('Contabilità per CDC - UACD'!N9:N21)=0,0,(SUM('Contabilità per CDC - UACD'!N9:N21)/SUM('Contabilità per CDC - UACD'!$E$9:$E$21)))","v":0.10647235319331333},{"$f":"IF(SUM('Contabilità per CDC - UACD'!O9:O21)=0,0,(SUM('Contabilità per CDC - UACD'!O9:O21)/SUM('Contabilità per CDC - UACD'!$E$9:$E$21)))","v":0},{"$f":"IF(SUM('Contabilità per CDC - UACD'!P9:P21)=0,0,(SUM('Contabilità per CDC - UACD'!P9:P21)/SUM('Contabilità per CDC - UACD'!$E$9:$E$21)))","v":0},{"$f":"IF(SUM('Contabilità per CDC - UACD'!R9:R21)=0,0,(SUM('Contabilità per CDC - UACD'!R9:R21)/SUM('Contabilità per CDC - UACD'!$E$9:$E$21)))","v":0},{"$f":"IF(SUM('Contabilità per CDC - UACD'!S9:S21)=0,0,(SUM('Contabilità per CDC - UACD'!S9:S21)/SUM('Contabilità per CDC - UACD'!$E$9:$E$21)))","v":3.7188169738534074E-2},{"$f":"IF(SUM('Contabilità per CDC - UACD'!T9:T21)=0,0,(SUM('Contabilità per CDC - UACD'!T9:T21)/SUM('Contabilità per CDC - UACD'!$E$9:$E$21)))","v":0.43720531504500643},{"$f":"IF(SUM('Contabilità per CDC - UACD'!U9:U21)=0,0,(SUM('Contabilità per CDC - UACD'!U9:U21)/SUM('Contabilità per CDC - UACD'!$E$9:$E$21)))","v":1.7145306472353193E-3},{"$f":"IF(SUM('Contabilità per CDC - UACD'!V9:V21)=0,0,(SUM('Contabilità per CDC - UACD'!V9:V21)/SUM('Contabilità per CDC - UACD'!$E$9:$E$21)))","v":3.4290612944706386E-3},{"$f":"IF(SUM('Contabilità per CDC - UACD'!W9:W21)=0,0,(SUM('Contabilità per CDC - UACD'!W9:W21)/SUM('Contabilità per CDC - UACD'!$E$9:$E$21)))","v":6.8581225889412772E-3},{"$f":"IF(SUM('Contabilità per CDC - UACD'!X9:X21)=0,0,(SUM('Contabilità per CDC - UACD'!X9:X21)/SUM('Contabilità per CDC - UACD'!$E$9:$E$21)))","v":3.4290612944706386E-3},{"$f":"IF(SUM('Contabilità per CDC - UACD'!Y9:Y21)=0,0,(SUM('Contabilità per CDC - UACD'!Y9:Y21)/SUM('Contabilità per CDC - UACD'!$E$9:$E$21)))","v":0},{"$f":"IF(SUM('Contabilità per CDC - UACD'!Z9:Z21)=0,0,(SUM('Contabilità per CDC - UACD'!Z9:Z21)/SUM('Contabilità per CDC - UACD'!$E$9:$E$21)))","v":0},{"$f":"IF(SUM('Contabilità per CDC - UACD'!AB9:AB21)=0,0,(SUM('Contabilità per CDC - UACD'!AB9:AB21)/SUM('Contabilità per CDC - UACD'!$E$9:$E$21)))","v":0.21003000428632662},null,{"$f":"IF(SUM('Contabilità per CDC - UACD'!AD9:AD21)=0,0,(SUM('Contabilità per CDC - UACD'!AD9:AD21)/SUM('Contabilità per CDC - UACD'!$E$9:$E$21)))","v":0},{"$f":"IF(SUM('Contabilità per CDC - UACD'!AE9:AE21)=0,0,(SUM('Contabilità per CDC - UACD'!AE9:AE21)/SUM('Contabilità per CDC - UACD'!$E$9:$E$21)))","v":0},{"$f":"IF(SUM('Contabilità per CDC - UACD'!AF9:AF21)=0,0,(SUM('Contabilità per CDC - UACD'!AF9:AF21)/SUM('Contabilità per CDC - UACD'!$E$9:$E$21)))","v":0},{"$f":"IF(SUM('Contabilità per CDC - UACD'!AG9:AG21)=0,0,(SUM('Contabilità per CDC - UACD'!AG9:AG21)/SUM('Contabilità per CDC - UACD'!$E$9:$E$21)))","v":0},{"$f":"IF(SUM('Contabilità per CDC - UACD'!AH9:AH21)=0,0,(SUM('Contabilità per CDC - UACD'!AH9:AH21)/SUM('Contabilità per CDC - UACD'!$E$9:$E$21)))","v":0},{"$f":"IF(SUM('Contabilità per CDC - UACD'!AI9:AI21)=0,0,(SUM('Contabilità per CDC - UACD'!AI9:AI21)/SUM('Contabilità per CDC - UACD'!$E$9:$E$21)))","v":0},{"$f":"IF(SUM('Contabilità per CDC - UACD'!AJ9:AJ21)=0,0,(SUM('Contabilità per CDC - UACD'!AJ9:AJ21)/SUM('Contabilità per CDC - UACD'!$E$9:$E$21)))","v":0},null,null,null,null,null,null,{"$f":"IF(SUM('Contabilità per CDC - UACD'!AS9:AS21)=0,0,(SUM('Contabilità per CDC - UACD'!AS9:AS21)/SUM('Contabilità per CDC - UACD'!$E$9:$E$21)))","v":1.7145306472353193E-3},{"$f":"IF(SUM('Contabilità per CDC - UACD'!AT9:AT21)=0,0,(SUM('Contabilità per CDC - UACD'!AT9:AT21)/SUM('Contabilità per CDC - UACD'!$E$9:$E$21)))","v":6.8581225889412772E-3},{"$f":"IF(SUM('Contabilità per CDC - UACD'!AV9:AV21)=0,0,(SUM('Contabilità per CDC - UACD'!AV9:AV21)/SUM('Contabilità per CDC - UACD'!$E$9:$E$21)))","v":0},{"$f":"IF(SUM('Contabilità per CDC - UACD'!AW9:AW21)=0,0,(SUM('Contabilità per CDC - UACD'!AW9:AW21)/SUM('Contabilità per CDC - UACD'!$E$9:$E$21)))","v":0},{"$f":"IF(SUM('Contabilità per CDC - UACD'!AX9:AX21)=0,0,(SUM('Contabilità per CDC - UACD'!AX9:AX21)/SUM('Contabilità per CDC - UACD'!$E$9:$E$21)))","v":0},{"$f":"IF(SUM('Contabilità per CDC - UACD'!AY9:AY21)=0,0,(SUM('Contabilità per CDC - UACD'!AY9:AY21)/SUM('Contabilità per CDC - UACD'!$E$9:$E$21)))","v":0},{"$f":"IF(SUM('Contabilità per CDC - UACD'!AZ9:AZ21)=0,0,(SUM('Contabilità per CDC - UACD'!AZ9:AZ21)/SUM('Contabilità per CDC - UACD'!$E$9:$E$21)))","v":0},{"$f":"IF(SUM('Contabilità per CDC - UACD'!BA9:BA21)=0,0,(SUM('Contabilità per CDC - UACD'!BA9:BA21)/SUM('Contabilità per CDC - UACD'!$E$9:$E$21)))","v":0},{"$f":"IF(SUM('Contabilità per CDC - UACD'!BB9:BB21)=0,0,(SUM('Contabilità per CDC - UACD'!BB9:BB21)/SUM('Contabilità per CDC - UACD'!$E$9:$E$21)))","v":0},{"$f":"IF(SUM('Contabilità per CDC - UACD'!BC9:BC21)=0,0,(SUM('Contabilità per CDC - UACD'!BC9:BC21)/SUM('Contabilità per CDC - UACD'!$E$9:$E$21)))","v":0},{"$f":"IF(SUM('Contabilità per CDC - UACD'!BD9:BD21)=0,0,(SUM('Contabilità per CDC - UACD'!BD9:BD21)/SUM('Contabilità per CDC - UACD'!$E$9:$E$21)))","v":0},{"$f":"IF(SUM('Contabilità per CDC - UACD'!BE9:BE21)=0,0,(SUM('Contabilità per CDC - UACD'!BE9:BE21)/SUM('Contabilità per CDC - UACD'!$E$9:$E$21)))","v":0},{"$f":"IF(SUM('Contabilità per CDC - UACD'!BG9:BG21)=0,0,(SUM('Contabilità per CDC - UACD'!BG9:BG21)/SUM('Contabilità per CDC - UACD'!$E$9:$E$21)))","v":0}]
["RIP040",{"$f":"K31","v":"Economia domestica in generale"},{"$f":"C16","v":"% retribuzione"},null,{"$f":"SUM(F37:BA37)","v":0.96493784826403772},{"$f":"F36","v":0},{"$f":"G36","v":0},{"$f":"H36","v":1.1830261465923704E-2},{"$f":"I36","v":0},{"$f":"IF(SUM('Contabilità per CDC - UACD'!J9:J21)=0,0,(SUM('Contabilità per CDC - UACD'!J9:J21)/SUM('Contabilità per CDC - UACD'!$E$9:$E$21)))","v":4.7338191170167167E-2},null,{"$f":"L36","v":4.6720960137162454E-2},{"$f":"M36","v":4.4149164166309471E-2},0.10647235319331333,0,0,{"$f":"Q36","v":0},3.7188169738534074E-2,{"$f":"S36","v":0.43720531504500643},1.7145306472353193E-3,3.4290612944706386E-3,6.8581225889412772E-3,3.4290612944706386E-3,0,0,{"$f":"Z36","v":0.21003000428632662},null,{"$f":"AB36","v":0},{"$f":"AC36","v":0},0,0,0,0,0,null,null,null,null,null,null,1.7145306472353193E-3,6.8581225889412772E-3,0,0,{"$f":"AS36","v":0},{"$f":"AT36","v":0},{"$f":"AU36","v":0},{"$f":"AV36","v":0},{"$f":"AW36","v":0},{"$f":"AX36","v":0},{"$f":"AY36","v":0},{"$f":"AZ36","v":0},0]
["RIP041",{"$f":"L31","v":"Lavanderia"},{"$f":"IF(E$17=\"x\",C$17,C$18)","v":"kg (sistematico)"},null,{"$f":"SUM(F38:BA38)","v":41580},null,null,200,null,null,200,null,2000,1200,null,null,26000,200,3000,40,50,null,null,null,null,8600,null,null,null,null,null,null,null,null,null,null,null,null,null,null,null,90]
["RIP042",{"$f":"M31","v":"Pulizia"},{"$f":"IF(E$19=\"x\",C$19,C$20)","v":"m2"},null,4545,null,75,50,null,100,80,100,null,320,null,null,2500,120,100,20,25,null,null,null,null,850,null,null,null,null,null,null,null,null,null,null,null,null,null,null,10,45,null,150]
["RIP060",{"$f":"N31","v":"Cucina"},{"$f":"IF(E$21=\"x\",C$21,C$22)","v":"Numero di pasti"},null,77050,null,null,null,null,null,null,null,null,null,null,null,64500,null,null,null,null,null,null,null,null,9900,null,null,null,null,null,null,null,null,null,null,null,null,null,null,null,null,null,1150,null,null,null,null,null,null,1500]
["RIP090",{"$f":"O31","v":"Magazzino centrale"},{"$f":"C$23","v":"Allocazione diretta"},null,0]
["RIP095",{"$f":"P31","v":"Farmacia"},{"$f":"C$24","v":"Allocazione diretta"},null,188000,null,null,null,null,null,null,null,null,null,null,null,null,null,null,null,null,null,null,60000,75000,53000]
[]
[]
["Tab. 3A - Costi unitari (costo dell'unità di ripartizione) per COAN UACD",null,null,null,null,null,null,null,null,null,null,null,null,null,null,null,null,null,null,null,null,null,null,null,null,"Nota Tab. 2A ",null,"I campi con sfondo grigio non debbono contenere \"pesi\" in quanto una ripartizione costi su questi CdC non è né tecnicamente possibile (CdC 161); né opportuna per la natura stessa del CdC in questione: voci di spesa interamente riconosciute nella parte individualizzata del Contratto di prestazione (da CdC 180 a CdC 184); voci di spesa non riconosciute a carico dell'Istituto (CdC 190)"]
[null,"Centri di costo generali","Unità",null,"costo unitario CHF"]
["RIP010",{"$f":"B32","v":"Edifici\n\n "},{"$f":"C32","v":"m2"},null,{"$f":"IF(E32=0,0,(-'Contabilità per CDC - UACD'!F48)/E32)","v":23.63834422657952}]
["RIP011",{"$f":"B33","v":"Energia"},{"$f":"C33","v":"m2"},null,{"$f":"IF(E33=0,0,(-'Contabilità per CDC - UACD'!G49)/E33)","v":28.367705311309226}]
["RIP020","Servizio tecnico","m2",null,{"$f":"IF(E34=0,0,(-'Contabilità per CDC - UACD'!H50)/E34)","v":23.303822918720929}]
["RIP021","Servizio trasporti","km (sistematico)",null,{"$f":"IF(E35=0,0,(-'Contabilità per CDC - UACD'!I51)/E35)","v":1.5789473684210527}]
["RIP030","Direzione/\nAmministrazione","% retribuzione",null,{"$f":"IF(E36=0,0,(-'Contabilità per CDC - UACD'!J52)/E36)","v":498755.60516552679}]
["RIP040","Economia domestica in generale","% retribuzione",null,{"$f":"IF(E37=0,0,(-'Contabilità per CDC - UACD'!K53)/E37)","v":97820.867074020018}]
["RIP041","Lavanderia","kg (sistematico)",null,{"$f":"IF(E38=0,0,(-'Contabilità per CDC - UACD'!L54)/E38)","v":9.6043067901245127}]
["RIP042","Pulizia","m2",null,{"$f":"IF(E39=0,0,(-'Contabilità per CDC - UACD'!M55)/E39)","v":87.460359262181697}]
["RIP060","Cucina","Numero di pasti",null,{"$f":"IF(E40=0,0,(-'Contabilità per CDC - UACD'!N56)/E40)","v":15.462246662059519}]
["RIP090","Magazzino centrale","Allocazione diretta",null,{"$f":"IF(E41=0,0,(-'Contabilità per CDC - UACD'!O57)/E41)","v":0}]
["RIP095","Farmacia","Allocazione diretta",null,{"$f":"IF(E42=0,0,(-'Contabilità per CDC - UACD'!P58)/E42)","v":2.6542553191489363E-2}]
[]
[]
["Tab. 4A  - Oneri sociali: calcolati in base ai salari o importi esatti per CdC"]
[]
[null,null,null,null,"Totale ","Centri di costo generali",null,null,null,null,null,null,null,null,null,null,"Centri di costo principali",null,null,null,null,null,null,null,null,"Servizi annessi",null,null,null,null,null,null,null,null,null,null,null,null,null,"Voci non riconosciute","Prestazioni all'atto",null,"Gestione estranea",null,null,null,null,null,null,null,null,null,"Gestione straordinaria"]
["X","= metodo scelto",null,null,"generale",{"$f":"F30","v":"010"},{"$f":"G30","v":"011"},"020","021","030","040","041","042","060","090","095",{"$f":"Q30","v":"100"},"110","115","130","131","132","140","150","151",160,161,162,163,"16X",170,171,172,"17X",180,181,182,183,184,190,800,"80x",900,905,910,915,920,925,930,935,940,945,990]
[{"$f":"IF(_xlfn.XOR(A65=\"X\",A66=\"X\"),\"\",\"scegliere un unico metodo di calcolo!\")","v":""},null,null,null,null,{"$f":"F31","v":"Edifici\n\n "},{"$f":"G31","v":"Energia"},"Servizio tecnico","Servizio trasporti","Direzione/\nAmministrazione","Economia domestica in generale","Lavanderia","Pulizia","Cucina","Magazzino centrale","Farmacia",{"$f":"Q31","v":"Servizio alberghiero"},"Animazione  ","Cura                    ","Fisioterapia","Ergoterapia                  ","Altre consulenze e terapie","Servizio medico                         ","Materiale\nsecondo EMAp","Medicamenti secondo ES / EMT","CAT","STT\n> NON COMPILARE !","Cure palliative","Reparto Alzheimer","STAZ n","Ambulatorio medico","Centro diurno terapeutico (CDT)","Appartamenti protetti","AMB n\n(CD socio-assistenziale, ecc.)","Altre voci riconosciute\n(oneri ipotecari\ne affitti)","Altre voci riconosciute (formazione apprendisti, stagiaires e ausiliari)","Altre voci riconosciute\n(neutralizzazione cassa pensione)","Altre voci riconosciute\n(contributi straordinari)","Altre voci riconosciute\n(Spese COVID-19\nAnno 2021)","Voci\nnon riconosciute","Gestione MEDICAMENTI\ne materiale all'atto","Gestione TERAPIE all'atto\n(fisio-, ergoterapia, altre terapie)\nn","Appartamenti\nper il personale","Bar e ristorante","Edicola","Negozio","Parrucchiere","Pedicure","Posteggi","Prestazioni di lavanderia a terzi","Vendita di pasti\na terzi","ESTR n","Gestione straordinaria"]
["X","C.to 37: calcolo automatico in base ai salari iscritti in 'Contabilità per CDC - UACD'",null,null,{"$f":"'Contabilità per CDC - UACD'!C22","v":1340000},{"$f":"IF(SUM('Contabilità per CDC - UACD'!$E9:$E19)=0,0,SUM('Contabilità per CDC - UACD'!F9:F19)/SUM('Contabilità per CDC - UACD'!$E9:$E19)*'Contabilità per CDC - UACD'!$E22)","v":0},{"$f":"IF(SUM('Contabilità per CDC - UACD'!$E9:$E19)=0,0,SUM('Contabilità per CDC - UACD'!G9:G19)/SUM('Contabilità per CDC - UACD'!$E9:$E19)*'Contabilità per CDC - UACD'!$E22)","v":0},{"$f":"IF(SUM('Contabilità per CDC - UACD'!$E9:$E19)=0,0,SUM('Contabilità per CDC - UACD'!H9:H19)/SUM('Contabilità per CDC - UACD'!$E9:$E19)*'Contabilità per CDC - UACD'!$E22)","v":15989.623865110245},{"$f":"IF(SUM('Contabilità per CDC - UACD'!$E9:$E19)=0,0,SUM('Contabilità per CDC - UACD'!I9:I19)/SUM('Contabilità per CDC - UACD'!$E9:$E19)*'Contabilità per CDC - UACD'!$E22)","v":0},{"$f":"IF(SUM('Contabilità per CDC - UACD'!$E9:$E19)=0,0,SUM('Contabilità per CDC - UACD'!J9:J19)/SUM('Contabilità per CDC - UACD'!$E9:$E19)*'Contabilità per CDC - UACD'!$E22)","v":63981.668828361435},{"$f":"IF(SUM('Contabilità per CDC - UACD'!$E9:$E19)=0,0,SUM('Contabilità per CDC - UACD'!K9:K19)/SUM('Contabilità per CDC - UACD'!$E9:$E19)*'Contabilità per CDC - UACD'!$E22)","v":12745.352356247296},{"$f":"IF(SUM('Contabilità per CDC - UACD'!$E9:$E19)=0,0,SUM('Contabilità per CDC - UACD'!L9:L19)/SUM('Contabilità per CDC - UACD'!$E9:$E19)*'Contabilità per CDC - UACD'!$E22)","v":63147.427583225246},{"$f":"IF(SUM('Contabilità per CDC - UACD'!$E9:$E19)=0,0,SUM('Contabilità per CDC - UACD'!M9:M19)/SUM('Contabilità per CDC - UACD'!$E9:$E19)*'Contabilità per CDC - UACD'!$E22)","v":59671.422395157802},{"$f":"IF(SUM('Contabilità per CDC - UACD'!$E9:$E19)=0,0,SUM('Contabilità per CDC - UACD'!N9:N19)/SUM('Contabilità per CDC - UACD'!$E9:$E19)*'Contabilità per CDC - UACD'!$E22)","v":143906.61478599222},{"$f":"IF(SUM('Contabilità per CDC - UACD'!$E9:$E19)=0,0,SUM('Contabilità per CDC - UACD'!O9:O19)/SUM('Contabilità per CDC - UACD'!$E9:$E19)*'Contabilità per CDC - UACD'!$E22)","v":0},{"$f":"IF(SUM('Contabilità per CDC - UACD'!$E9:$E19)=0,0,SUM('Contabilità per CDC - UACD'!P9:P19)/SUM('Contabilità per CDC - UACD'!$E9:$E19)*'Contabilità per CDC - UACD'!$E22)","v":0},{"$f":"IF(SUM('Contabilità per CDC - UACD'!$E9:$E19)=0,0,SUM('Contabilità per CDC - UACD'!R9:R19)/SUM('Contabilità per CDC - UACD'!$E9:$E19)*'Contabilità per CDC - UACD'!$E22)","v":0},{"$f":"IF(SUM('Contabilità per CDC - UACD'!$E9:$E19)=0,0,SUM('Contabilità per CDC - UACD'!S9:S19)/SUM('Contabilità per CDC - UACD'!$E9:$E19)*'Contabilità per CDC - UACD'!$E22)","v":50263.035019455252},{"$f":"IF(SUM('Contabilità per CDC - UACD'!$E9:$E19)=0,0,SUM('Contabilità per CDC - UACD'!T9:T19)/SUM('Contabilità per CDC - UACD'!$E9:$E19)*'Contabilità per CDC - UACD'!$E22)","v":579334.19801124081},{"$f":"IF(SUM('Contabilità per CDC - UACD'!$E9:$E19)=0,0,SUM('Contabilità per CDC - UACD'!U9:U19)/SUM('Contabilità per CDC - UACD'!$E9:$E19)*'Contabilità per CDC - UACD'!$E22)","v":2317.3367920449632},{"$f":"IF(SUM('Contabilità per CDC - UACD'!$E9:$E19)=0,0,SUM('Contabilità per CDC - UACD'!V9:V19)/SUM('Contabilità per CDC - UACD'!$E9:$E19)*'Contabilità per CDC - UACD'!$E22)","v":4634.6735840899264},{"$f":"IF(SUM('Contabilità per CDC - UACD'!$E9:$E19)=0,0,SUM('Contabilità per CDC - UACD'!W9:W19)/SUM('Contabilità per CDC - UACD'!$E9:$E19)*'Contabilità per CDC - UACD'!$E22)","v":9269.3471681798528},{"$f":"IF(SUM('Contabilità per CDC - UACD'!$E9:$E19)=0,0,SUM('Contabilità per CDC - UACD'!X9:X19)/SUM('Contabilità per CDC - UACD'!$E9:$E19)*'Contabilità per CDC - UACD'!$E22)","v":4634.6735840899264},{"$f":"IF(SUM('Contabilità per CDC - UACD'!$E9:$E19)=0,0,SUM('Contabilità per CDC - UACD'!Y9:Y19)/SUM('Contabilità per CDC - UACD'!$E9:$E19)*'Contabilità per CDC - UACD'!$E22)","v":0},{"$f":"IF(SUM('Contabilità per CDC - UACD'!$E9:$E19)=0,0,SUM('Contabilità per CDC - UACD'!Z9:Z19)/SUM('Contabilità per CDC - UACD'!$E9:$E19)*'Contabilità per CDC - UACD'!$E22)","v":0},{"$f":"IF(SUM('Contabilità per CDC - UACD'!$E9:$E19)=0,0,SUM('Contabilità per CDC - UACD'!AB9:AB19)/SUM('Contabilità per CDC - UACD'!$E9:$E19)*'Contabilità per CDC - UACD'!$E22)","v":283873.75702550798},null,{"$f":"IF(SUM('Contabilità per CDC - UACD'!$E9:$E19)=0,0,SUM('Contabilità per CDC - UACD'!AD9:AD19)/SUM('Contabilità per CDC - UACD'!$E9:$E19)*'Contabilità per CDC - UACD'!$E22)","v":0},{"$f":"IF(SUM('Contabilità per CDC - UACD'!$E9:$E19)=0,0,SUM('Contabilità per CDC - UACD'!AE9:AE19)/SUM('Contabilità per CDC - UACD'!$E9:$E19)*'Contabilità per CDC - UACD'!$E22)","v":0},{"$f":"IF(SUM('Contabilità per CDC - UACD'!$E9:$E19)=0,0,SUM('Contabilità per CDC - UACD'!AF9:AF19)/SUM('Contabilità per CDC - UACD'!$E9:$E19)*'Contabilità per CDC - UACD'!$E22)","v":0},{"$f":"IF(SUM('Contabilità per CDC - UACD'!$E9:$E19)=0,0,SUM('Contabilità per CDC - UACD'!AG9:AG19)/SUM('Contabilità per CDC - UACD'!$E9:$E19)*'Contabilità per CDC - UACD'!$E22)","v":0},{"$f":"IF(SUM('Contabilità per CDC - UACD'!$E9:$E19)=0,0,SUM('Contabilità per CDC - UACD'!AH9:AH19)/SUM('Contabilità per CDC - UACD'!$E9:$E19)*'Contabilità per CDC - UACD'!$E22)","v":0},{"$f":"IF(SUM('Contabilità per CDC - UACD'!$E9:$E19)=0,0,SUM('Contabilità per CDC - UACD'!AI9:AI19)/SUM('Contabilità per CDC - UACD'!$E9:$E19)*'Contabilità per CDC - UACD'!$E22)","v":0},{"$f":"IF(SUM('Contabilità per CDC - UACD'!$E9:$E19)=0,0,SUM('Contabilità per CDC - UACD'!AJ9:AJ19)/SUM('Contabilità per CDC - UACD'!$E9:$E19)*'Contabilità per CDC - UACD'!$E22)","v":0},{"$f":"IF(SUM('Contabilità per CDC - UACD'!$E9:$E19)=0,0,SUM('Contabilità per CDC - UACD'!AK9:AK19)/SUM('Contabilità per CDC - UACD'!$E9:$E19)*'Contabilità per CDC - UACD'!$E22)","v":0},{"$f":"IF(SUM('Contabilità per CDC - UACD'!$E9:$E19)=0,0,SUM('Contabilità per CDC - UACD'!AL9:AL19)/SUM('Contabilità per CDC - UACD'!$E9:$E19)*'Contabilità per CDC - UACD'!$E22)","v":12281.884997838306},{"$f":"IF(SUM('Contabilità per CDC - UACD'!$E9:$E19)=0,0,SUM('Contabilità per CDC - UACD'!AM9:AM19)/SUM('Contabilità per CDC - UACD'!$E9:$E19)*'Contabilità per CDC - UACD'!$E22)","v":0},{"$f":"IF(SUM('Contabilità per CDC - UACD'!$E9:$E19)=0,0,SUM('Contabilità per CDC - UACD'!AN9:AN19)/SUM('Contabilità per CDC - UACD'!$E9:$E19)*'Contabilità per CDC - UACD'!$E22)","v":0},{"$f":"IF(SUM('Contabilità per CDC - UACD'!$E9:$E19)=0,0,SUM('Contabilità per CDC - UACD'!AO9:AO19)/SUM('Contabilità per CDC - UACD'!$E9:$E19)*'Contabilità per CDC - UACD'!$E22)","v":22362.300043233896},{"$f":"IF(SUM('Contabilità per CDC - UACD'!$E9:$E19)=0,0,SUM('Contabilità per CDC - UACD'!AQ9:AQ19)/SUM('Contabilità per CDC - UACD'!$E9:$E19)*'Contabilità per CDC - UACD'!$E22)","v":0},{"$f":"IF(SUM('Contabilità per CDC - UACD'!$E9:$E19)=0,0,SUM('Contabilità per CDC - UACD'!AS9:AS19)/SUM('Contabilità per CDC - UACD'!$E9:$E19)*'Contabilità per CDC - UACD'!$E22)","v":2317.3367920449632},{"$f":"IF(SUM('Contabilità per CDC - UACD'!$E9:$E19)=0,0,SUM('Contabilità per CDC - UACD'!AT9:AT19)/SUM('Contabilità per CDC - UACD'!$E9:$E19)*'Contabilità per CDC - UACD'!$E22)","v":9269.3471681798528},{"$f":"IF(SUM('Contabilità per CDC - UACD'!$E9:$E19)=0,0,SUM('Contabilità per CDC - UACD'!AV9:AV19)/SUM('Contabilità per CDC - UACD'!$E9:$E19)*'Contabilità per CDC - UACD'!$E22)","v":0},{"$f":"IF(SUM('Contabilità per CDC - UACD'!$E9:$E19)=0,0,SUM('Contabilità per CDC - UACD'!AW9:AW19)/SUM('Contabilità per CDC - UACD'!$E9:$E19)*'Contabilità per CDC - UACD'!$E22)","v":0},{"$f":"IF(SUM('Contabilità per CDC - UACD'!$E9:$E19)=0,0,SUM('Contabilità per CDC - UACD'!AX9:AX19)/SUM('Contabilità per CDC - UACD'!$E9:$E19)*'Contabilità per CDC - UACD'!$E22)","v":0},{"$f":"IF(SUM('Contabilità per CDC - UACD'!$E9:$E19)=0,0,SUM('Contabilità per CDC - UACD'!AY9:AY19)/SUM('Contabilità per CDC - UACD'!$E9:$E19)*'Contabilità per CDC - UACD'!$E22)","v":0},{"$f":"IF(SUM('Contabilità per CDC - UACD'!$E9:$E19)=0,0,SUM('Contabilità per CDC - UACD'!AZ9:AZ19)/SUM('Contabilità per CDC - UACD'!$E9:$E19)*'Contabilità per CDC - UACD'!$E22)","v":0},{"$f":"IF(SUM('Contabilità per CDC - UACD'!$E9:$E19)=0,0,SUM('Contabilità per CDC - UACD'!BA9:BA19)/SUM('Contabilità per CDC - UACD'!$E9:$E19)*'Contabilità per CDC - UACD'!$E22)","v":0},{"$f":"IF(SUM('Contabilità per CDC - UACD'!$E9:$E19)=0,0,SUM('Contabilità per CDC - UACD'!BB9:BB19)/SUM('Contabilità per CDC - UACD'!$E9:$E19)*'Contabilità per CDC - UACD'!$E22)","v":0},{"$f":"IF(SUM('Contabilità per CDC - UACD'!$E9:$E19)=0,0,SUM('Contabilità per CDC - UACD'!BC9:BC19)/SUM('Contabilità per CDC - UACD'!$E9:$E19)*'Contabilità per CDC - UACD'!$E22)","v":0},{"$f":"IF(SUM('Contabilità per CDC - UACD'!$E9:$E19)=0,0,SUM('Contabilità per CDC - UACD'!BD9:BD18)/SUM('Contabilità per CDC - UACD'!$E9:$E19)*'Contabilità per CDC - UACD'!$E22)","v":0},{"$f":"IF(SUM('Contabilità per CDC - UACD'!$E9:$E19)=0,0,SUM('Contabilità per CDC - UACD'!BE9:BE19)/SUM('Contabilità per CDC - UACD'!$E9:$E19)*'Contabilità per CDC - UACD'!$E22)","v":0},{"$f":"IF(SUM('Contabilità per CDC - UACD'!$E9:$E19)=0,0,SUM('Contabilità per CDC - UACD'!BG9:BG19)/SUM('Contabilità per CDC - UACD'!$E9:$E19)*'Contabilità per CDC - UACD'!$E22)","v":0}]
[null,"C.to 37: importi esatti da inserire in 'Contabilità per CDC - UACD'",null,null,{"$f":"SUM(F66:BA66)","v":1340000},0,0,16000,0,66850,12000,62000,58500,140000,0,0,0,50000,578000,2500,5000,9250,4600,0,0,290000,null,null,null,null,null,null,null,null,null,7800,null,null,22500,null,2500,9500,null,null,null,null,null,null,null,null,3000]
[]
[]
[]
["******************** RIPARTIZIONI PER SOMED**************************************************************************************************************************************************************************************************************************************************************************************************************************************************************************************************************************************************"]
[]
["Tab. 2B -  Ripartizioni per COAN SOMED-A"]
[null,null,null,null,"Totale ","Centri di costo generali",null,null,null,null,null,null,null,null,null,null,"Centri di costo principali",null,null,null,null,null,null,null,null,"Servizi annessi",null,null,null,null,null,null,null,null,null,null,null,null,null,"Voci non riconosciute","Prestazioni all'atto\nCdC SPOSTATI per SOMED",null,"Gestione estranea  - CdC DELIMITATI per SOMED",null,null,null,null,null,null,null,null,null,"Gestione straordinaria",null,"Formula di controllo"]
[null,"\nCentri di costo generali","Unità",null,"generale","010","011","020","021","030","040","041","042","060","090","095","100","110","115","130","131","132","140","150","151","160+161",null,162,163,"16X",170,171,172,"17X",180,181,182,183,184,190,800,"80x",900,905,910,915,920,925,930,935,940,945,990]
[null,null,null,null,null,"Edifici\n\n ","Energia","Servizio tecnico","Servizio trasporti","Direzione/\nAmministrazione","Economia domestica in generale","Lavanderia","Pulizia","Cucina","Magazzino centrale","Farmacia","Servizio alberghiero","Animazione  ","Cura                    ","Fisioterapia","Ergoterapia                  ","Altre consulenze e terapie","Servizio medico                         ","Materiale\nsecondo EMAp","Medicamenti secondo ES/EMT","CAT-STT",null,"Cure palliative\n\nCdC SPOSTATO per SOMED","Reparto Alzheimer\n\nCdC SPOSTATO per SOMED","STAZ n\n\n\nCdC SPOSTATO per SOMED","Ambulatorio medico\n\nCdC DELIMITATO per SOMED","Centro diurno terapeutico (CDT)","Appartamenti protetti\n\nCdC DELIMITATO per SOMED","AMB n (CD socio-ass. ecc.)\n\nCdC SPOSTATO per SOMED","Altre voci riconosciute\n(oneri ipotecari\ne affitti)\n\nCdC SPOSTATO per SOMED","Altre voci riconosciute (formazione apprendisti, stagiaires e ausiliari)\n\nCdC SPOSTATO per SOMED","Altre voci riconosciute\n(neutralizzazione cassa pensione)\n\nCdC SPOSTATO per SOMED","Altre voci riconosciute\n(contributi straordinari)\n\nCdC SPOSTATO per SOMED","Altre voci riconosciute\n(Spese COVID-19\nAnno 2021)\n\nCdC SPOSTATO per SOMED","Voci non riconosciute\n\nCdC SPOSTATO per SOMED","Gestione MEDICAMENTI\ne materiale all'atto","Gestione TERAPIE all'atto\n(fisio-, ergoterapia, altre terapie)\nn","Appartamenti\nper il personale","Bar e ristorante","Edicola","Negozio","Parrucchiere","Pedicure","Posteggi","Prestazioni di lavanderia a terzi","Vendita di pasti\na terzi","ESTR n","Gestione straordinaria\n\n CdC DELIMITATO per SOMED"]
["RIP010","Edifici\n\n ",{"$f":"C32","v":"m2"},null,{"$f":"SUM(F76:BA76)","v":4440},null,{"$f":"G32","v":75},{"$f":"H32","v":50},{"$f":"I32","v":0},{"$f":"J32","v":100},80,100,45,320,0,0,{"$f":"Q32+AB32+AC32+AD32","v":2500},{"$f":"R32+AH32","v":120},100,{"$f":"T32+(0.5*AP32)","v":42.5},{"$f":"U32+(0.5*AP32)","v":47.5},0,0,0,{"$f":"Y32+AO32","v":10},{"$f":"SUM(Z32,AA32)","v":850},null,null,null,null,null,{"$f":"AF32","v":0},null,null,null,null,null,null,null,null,null,null,null,null,null,null,null,null,null,null,null,null,null,null,{"$f":"+E32-E76-AE32-AG32-AI32-AJ32-AK32-AL32-AO32-AP32-AQ32-AR32-AS32-AT32-AU32-AV32-AW32-AX32-AY32-AZ32-BA32","v":-55}]
["RIP011","Energia",{"$f":"C33","v":"m2"},null,{"$f":"SUM(F77:BA77)","v":4365},{"$f":"F33","v":0},null,{"$f":"H33","v":50},{"$f":"I33","v":0},{"$f":"J33","v":100},80,100,45,320,0,0,{"$f":"Q33+AB33+AC33+AD33","v":2500},{"$f":"R33+AH33","v":120},100,{"$f":"T33+(0.5*AP33)","v":42.5},{"$f":"U33+(0.5*AP33)","v":47.5},0,0,0,{"$f":"Y33+AO33","v":10},{"$f":"SUM(Z33,AA33)","v":850},null,null,null,null,null,{"$f":"AF33","v":0},null,null,null,null,null,null,null,null,null,null,null,null,null,null,null,null,null,null,null,null,null,null,{"$f":"+E33-E77-AE33-AG33-AI33-AJ33-AK33-AL33-AO33-AP33-AQ33-AR33-AS33-AT33-AU33-AV33-AW33-AX33-AY33-AZ33-BA33","v":-55}]
["RIP020","Servizio tecnico","m2",null,4390,{"$f":"F34","v":0},{"$f":"G34","v":75},null,{"$f":"I34","v":0},100,80,100,45,320,0,0,{"$f":"Q34+AB34+AC34+AD34","v":2500},{"$f":"R34+AH34","v":120},{"$f":"S34","v":100},42.5,47.5,0,0,0,10,850,null,null,null,null,null,{"$f":"AF34","v":0},null,null,null,null,null,null,null,null,null,null,null,null,null,null,null,null,null,null,null,null,null,null,-55]
["RIP021","Servizio trasporti","km (sistematico)",null,1900,{"$f":"F35","v":0},{"$f":"G35","v":0},{"$f":"H35","v":100},null,{"$f":"J35","v":1100},{"$f":"K35","v":0},0,0,50,0,0,{"$f":"Q35+AB35+AC35+AD35","v":0},{"$f":"R35+AH35","v":150},{"$f":"S35","v":500},0,0,{"$f":"V35","v":0},0,0,0,0,null,null,null,null,null,{"$f":"AF35","v":0},null,null,null,null,null,null,null,null,null,null,null,null,null,null,null,null,null,null,null,null,null,null,0]
["RIP030","Direzione/\nAmministrazione","% retribuzione",null,0.94818849978383046,{"$f":"IF(SUM('Contabilità per CDC - SOMED'!F9:F19)=0,0,(SUM('Contabilità per CDC - SOMED'!F9:F19)/SUM('Contabilità per CDC - SOMED'!$E$9:$E$19)))","v":0},{"$f":"IF(SUM('Contabilità per CDC - SOMED'!G9:G19)=0,0,(SUM('Contabilità per CDC - SOMED'!G9:G19)/SUM('Contabilità per CDC - SOMED'!$E$9:$E$19)))","v":0},{"$f":"IF(SUM('Contabilità per CDC - SOMED'!H9:H19)=0,0,(SUM('Contabilità per CDC - SOMED'!H9:H19)/SUM('Contabilità per CDC - SOMED'!$E$9:$E$19)))","v":1.3143104193687851E-2},{"$f":"IF(SUM('Contabilità per CDC - SOMED'!I9:I19)=0,0,(SUM('Contabilità per CDC - SOMED'!I9:I19)/SUM('Contabilità per CDC - SOMED'!$E$9:$E$19)))","v":0},null,{"$f":"IF(SUM('Contabilità per CDC - SOMED'!K9:K19)=0,0,(SUM('Contabilità per CDC - SOMED'!K9:K19)/SUM('Contabilità per CDC - SOMED'!$E$9:$E$19)))","v":9.5114569822741021E-3},{"$f":"IF(SUM('Contabilità per CDC - SOMED'!L9:L19)=0,0,(SUM('Contabilità per CDC - SOMED'!L9:L19)/SUM('Contabilità per CDC - SOMED'!$E$9:$E$19)))","v":4.885430177258971E-2},{"$f":"IF(SUM('Contabilità per CDC - SOMED'!M9:M19)=0,0,(SUM('Contabilità per CDC - SOMED'!M9:M19)/SUM('Contabilità per CDC - SOMED'!$E$9:$E$19)))","v":4.7124945957630782E-2},{"$f":"IF(SUM('Contabilità per CDC - SOMED'!N9:N19)=0,0,(SUM('Contabilità per CDC - SOMED'!N9:N19)/SUM('Contabilità per CDC - SOMED'!$E$9:$E$19)))","v":0.10739299610894941},{"$f":"IF(SUM('Contabilità per CDC - SOMED'!O9:O19)=0,0,(SUM('Contabilità per CDC - SOMED'!O9:O19)/SUM('Contabilità per CDC - SOMED'!$E$9:$E$19)))","v":0},{"$f":"IF(SUM('Contabilità per CDC - SOMED'!P9:P19)=0,0,(SUM('Contabilità per CDC - SOMED'!P9:P19)/SUM('Contabilità per CDC - SOMED'!$E$9:$E$19)))","v":1.7293558149589277E-3},{"$f":"IF(SUM('Contabilità per CDC - SOMED'!R9:R19)=0,0,(SUM('Contabilità per CDC - SOMED'!R9:R19)/SUM('Contabilità per CDC - SOMED'!$E$9:$E$19)))","v":0},{"$f":"IF(SUM('Contabilità per CDC - SOMED'!S9:S19)=0,0,(SUM('Contabilità per CDC - SOMED'!S9:S19)/SUM('Contabilità per CDC - SOMED'!$E$9:$E$19)))","v":3.7509727626459141E-2},{"$f":"IF(SUM('Contabilità per CDC - SOMED'!T9:T19)=0,0,(SUM('Contabilità per CDC - SOMED'!T9:T19)/SUM('Contabilità per CDC - SOMED'!$E$9:$E$19)))","v":0.44850843060959794},{"$f":"IF(SUM('Contabilità per CDC - SOMED'!U9:U19)=0,0,(SUM('Contabilità per CDC - SOMED'!U9:U19)/SUM('Contabilità per CDC - SOMED'!$E$9:$E$19)))","v":4.3233895373973198E-3},{"$f":"IF(SUM('Contabilità per CDC - SOMED'!V9:V19)=0,0,(SUM('Contabilità per CDC - SOMED'!V9:V19)/SUM('Contabilità per CDC - SOMED'!$E$9:$E$19)))","v":7.8685689580631213E-3},{"$f":"IF(SUM('Contabilità per CDC - SOMED'!W9:W19)=0,0,(SUM('Contabilità per CDC - SOMED'!W9:W19)/SUM('Contabilità per CDC - SOMED'!$E$9:$E$19)))","v":6.9174232598357109E-3},{"$f":"IF(SUM('Contabilità per CDC - SOMED'!X9:X19)=0,0,(SUM('Contabilità per CDC - SOMED'!X9:X19)/SUM('Contabilità per CDC - SOMED'!$E$9:$E$19)))","v":3.4587116299178555E-3},{"$f":"IF(SUM('Contabilità per CDC - SOMED'!Y9:Y19)=0,0,(SUM('Contabilità per CDC - SOMED'!Y9:Y19)/SUM('Contabilità per CDC - SOMED'!$E$9:$E$19)))","v":0},{"$f":"IF(SUM('Contabilità per CDC - SOMED'!Z9:Z19)=0,0,(SUM('Contabilità per CDC - SOMED'!Z9:Z19)/SUM('Contabilità per CDC - SOMED'!$E$9:$E$19)))","v":0},{"$f":"IF(SUM('Contabilità per CDC - SOMED'!AB9:AC19)=0,0,(SUM('Contabilità per CDC - SOMED'!AB9:AC19)/SUM('Contabilità per CDC - SOMED'!$E$9:$E$19)))","v":0.21184608733246865},null,null,null,null,null,{"$f":"IF(SUM('Contabilità per CDC - SOMED'!AH9:AH19 )=0,0,(SUM('Contabilità per CDC - SOMED'!AH9:AH19)/SUM('Contabilità per CDC - SOMED'!$E$9:$E$19)))","v":0},null,null,null,null,null,null,null,null,null,null,null,null,null,null,null,null,null,null,null,null,null,null,-2.9731577366342112E-2]
["RIP040","Economia domestica in generale","% retribuzione",null,0.99048854301772582,{"$f":"F80","v":0},{"$f":"G80","v":0},1.3143104193687851E-2,0,{"$f":"IF(SUM('Contabilità per CDC - SOMED'!J9:J19)=0,0,(SUM('Contabilità per CDC - SOMED'!J9:J19)/SUM('Contabilità per CDC - SOMED'!$E$9:$E$19)))","v":5.1811500216169475E-2},null,{"$f":"L80","v":4.885430177258971E-2},{"$f":"M80","v":4.7124945957630782E-2},{"$f":"N80","v":0.10739299610894941},{"$f":"O80","v":0},{"$f":"P80","v":1.7293558149589277E-3},{"$f":"Q80","v":0},{"$f":"R80","v":3.7509727626459141E-2},0.44850843060959794,4.3233895373973198E-3,7.8685689580631213E-3,6.9174232598357109E-3,3.4587116299178555E-3,0,0,{"$f":"Z80","v":0.21184608733246865},null,null,null,null,null,{"$f":"AF80","v":0},null,null,null,null,null,null,null,null,null,null,null,null,null,null,null,null,null,null,null,null,null,null,-3.4123347989864695E-2]
["RIP041","Lavanderia","kg (sistematico)",null,41580,{"$f":"F38","v":0},0,200,0,{"$f":"J38","v":0},200,null,{"$f":"M38","v":2000},{"$f":"N38","v":1200},{"$f":"O38","v":0},{"$f":"P38","v":0},{"$f":"Q38+AB38+AC38+AD38","v":26000},{"$f":"R38+AH38","v":200},{"$f":"S38","v":3000},{"$f":"T38+(0.5*AP38)","v":85},{"$f":"U38+(0.5*AP38)","v":95},0,0,0,{"$f":"Y38+AO38","v":0},{"$f":"SUM(Z38,AA38)","v":8600},null,null,null,null,null,{"$f":"AF38","v":0},null,null,null,null,null,null,null,null,null,null,null,null,null,null,null,null,null,null,null,null,null,null,-90]
["RIP042","Pulizia","m2",null,4395,0,75,50,0,100,80,{"$f":"L39","v":100},null,{"$f":"N39","v":320},{"$f":"O39","v":0},{"$f":"P39","v":0},{"$f":"Q39+AB39+AC39+AD39","v":2500},{"$f":"R39+AH39","v":120},{"$f":"S39","v":100},42.5,47.5,0,0,0,10,{"$f":"SUM(Z39,AA39)","v":850},null,null,null,null,null,{"$f":"AF39","v":0},null,null,null,null,null,null,null,null,null,null,null,null,null,null,null,null,null,null,null,null,null,null,-55]
["RIP060","Cucina","Numero di pasti",null,74400,0,0,0,0,{"$f":"J40","v":0},0,{"$f":"L40","v":0},0,null,{"$f":"O40","v":0},{"$f":"P40","v":0},{"$f":"Q40+AB40+AC40+AD40","v":64500},{"$f":"R40+AH40","v":0},{"$f":"S40","v":0},0,0,0,0,0,0,9900,null,null,null,null,null,{"$f":"AF40","v":0},null,null,null,null,null,null,null,null,null,null,null,null,null,null,null,null,null,null,null,null,null,null,0]
["RIP090","Magazzino centrale","Allocazione diretta",null,0,0,0,0,0,{"$f":"J41","v":0},0,{"$f":"L41","v":0},0,{"$f":"N41","v":0},null,{"$f":"P41","v":0},{"$f":"Q41+AB41+AC41+AD41","v":0},{"$f":"R41+AH41","v":0},{"$f":"S41","v":0},0,0,0,0,0,0,0,null,null,null,null,null,{"$f":"AF41","v":0},null,null,null,null,null,null,null,null,null,null,null,null,null,null,null,null,null,null,null,null,null,null,0]
["RIP095","Farmacia","Allocazione diretta",null,{"$f":"SUM(F86:BA86)","v":188000},0,0,0,0,{"$f":"J42","v":0},0,{"$f":"L42","v":0},0,{"$f":"N42","v":0},0,null,{"$f":"Q42+AB42+AC42+AD42","v":0},{"$f":"R42+AH42","v":0},{"$f":"S42","v":0},0,0,0,0,60000,75000,53000,null,null,null,null,null,{"$f":"AF42","v":0},null,null,null,null,null,null,null,null,null,null,null,null,null,null,null,null,null,null,null,null,null,null,0]
[]
[]
["Tab. 3B - Costi unitari (costo dell'unità di ripartizione) per COAN SOMED-A",null,null,null,null,null,null,null,null,null,null,null,null,null,null,null,null,null,null,null,null,null,null,null,null,"Nota Tab. 2B ",null,"I pesi dei CdC colorati in violetto sono SPOSTATI (tramite formule di calcolo) nei CdC principali (solo per SOMED)."]
[null,"Centri di costo generali","Unità",null,"costo unitario CHF",null,null,null,null,null,null,null,null,null,null,null,null,null,null,null,null,null,null,null,null,null,null,"I pesi dei CdC DELIMITATI sono tralasciati in quanto questi CdC non sono considerati per SOMED. Valgono inoltre le osservazioni esposte nella nota alla Tab. 2A sopra. "]
["RIP010","Edifici\n\n ",{"$f":"C47","v":"m2"},null,{"$f":"IF(E76=0,0,(-'Contabilità per CDC - SOMED'!F48)/E76)","v":309.43068656892189}]
["RIP011","Energia",{"$f":"C48","v":"m2"},null,{"$f":"IF(E77=0,0,(-'Contabilità per CDC - SOMED'!G49)/E77)","v":35.072991049573197}]
["RIP020","Servizio tecnico","m2",null,{"$f":"IF(E78=0,0,(-'Contabilità per CDC - SOMED'!H50)/E78)","v":32.651078827280628}]
["RIP021","Servizio trasporti","km (sistematico)",null,{"$f":"IF(E79=0,0,(-'Contabilità per CDC - SOMED'!I51)/E79)","v":6.1789473684210527}]
["RIP030","Direzione/\nAmministrazione","% retribuzione",null,{"$f":"IF(E80=0,0,(-'Contabilità per CDC - SOMED'!J52)/E80)","v":664627.16183446976}]
["RIP040","Economia domestica in generale","% retribuzione",null,{"$f":"IF(E81=0,0,(-'Contabilità per CDC - SOMED'!K53)/E81)","v":122571.00856166273}]
["RIP041","Lavanderia","kg (sistematico)",null,{"$f":"IF(E82=0,0,(-'Contabilità per CDC - SOMED'!L54)/E82)","v":11.233045616505501}]
["RIP042","Pulizia","m2",null,{"$f":"IF(E83=0,0,(-'Contabilità per CDC - SOMED'!M55)/E83)","v":100.36839097824316}]
["RIP060","Cucina","Numero di pasti",null,{"$f":"IF(E84=0,0,(-'Contabilità per CDC - SOMED'!N56)/E84)","v":17.171719244090273}]
["RIP090","Magazzino centrale","Allocazione diretta",null,{"$f":"IF(E85=0,0,(-'Contabilità per CDC - SOMED'!O57)/E85)","v":0}]
["RIP095","Farmacia","Allocazione diretta",null,{"$f":"IF(E86=0,0,(-'Contabilità per CDC - SOMED'!P58)/E86)","v":0.13335449482054171}]

{"sheet":"Contabilità per CDC - UACD","index":4,"n_rows":82,"n_cols":63,"rows_kept":82,"cut":false,"hidden":false,"merged":[[4,5,4,15],[4,44,4,46],[4,42,4,43],[4,47,4,56],[4,58,4,59],[4,27,4,40],[4,17,4,25]]}
["Contabilità analitica per centri di costo  - UACD",null,null,null,null,null,null,null,null,null,null,null,null,null,null,null,null,null,null,null,null,null,null,"   C O A N   -   U A C D ",null,null,null,null,null,null,null,null,null,null,null,null,null,null,null,null,null,null,null,null,null,null,"   C O A N   -   U A C D "]
[{"$f":"Parametri!$B$7","v":2021},{"$f":"Parametri!$B$3","v":"ESEMPIO - CPA STANDARD CON CAT-STT"},null,null,null,null,null,null,null,null,null,null,null,null,null,null,null,null,null,null,null,null,null,{"$f":"+A2","v":2021},{"$f":"+B2","v":"ESEMPIO - CPA STANDARD CON CAT-STT"},null,null,null,null,null,null,null,null,null,null,null,null,null,null,null,null,null,null,null,null,null,{"$f":"+A2","v":2021},{"$f":"+B2","v":"ESEMPIO - CPA STANDARD CON CAT-STT"}]
[]
[null,null,null,null,null,"                C o n t a b i l i t à    a n a l i t i c a     p e r    c e n t r i    d i    c o s t o            U A C D   "]
[null,null,null,null,null,"                C e n t r i    d i    c o s t o    g e n e r a l i",null,null,null,null,null,null,null,null,null,null,null,"                 Ce n t r i    d i    c o s t o    p r i n c i p a l i",null,null,null,null,null,null,null,null,null,"                S e r v i z i    a n n e s s i",null,null,null,null,null,null,null,null,null,null,null,null,null,null,"Voci non riconosciute",null,"     Prestazioni all'atto",null,null,"              G e s t i o n e    e s t r a n e a",null,null,null,null,null,null,null,null,null,null,"Gestione straordinaria",null,"CdC tecnico"]
[null,null,"COFI ",null,"COAN ","010","011","020","021","030","040","041","042","060","090","095","Totale ","100","110","115","130","131","132","140","150","151","Totale ",160,161,162,163,"16X",170,171,172,"17X",180,181,182,183,184,"Totale ",190,"Totale ",800,"80x","Totale ",900,905,910,915,920,925,930,935,940,945,"Totale ",990,"Totale ",999]
[null,"CDC per UACD ","Contabilità \nfinanziaria \n\nCosti","Delimitazioni \n+/-","Contabilità \nanalitica \n\nCosti ","Edifici\n\n ","Energia","Servizio tecnico","Servizio trasporti","Direzione/\nAmministrazione","Economia domestica in generale","Lavanderia","Pulizia","Cucina","Magazzino centrale","Farmacia",null,"Servizio alberghiero","Animazione  ","Cura                    ","Fisioterapia","Ergoterapia                  ","Altre consulenze e terapie","Servizio medico                         ","Materiale\nsecondo EMAp","Medicamenti secondo ES / EMT",null,"CAT","STT\n> NON COMPILARE !","Cure palliative","Reparto Alzheimer","STAZ n","Ambulatorio medico","Centro diurno terapeutico (CDT)","Appartamenti protetti","AMB n\n(CD socio-assistenziale, ecc.)","Altre voci riconosciute\n(oneri ipotecari\ne affitti)","Altre voci riconosciute (formazione apprendisti, stagiaires e ausiliari)","Altre voci riconosciute\n(neutralizzazione cassa pensione)","Altre voci riconosciute\n(contributi straordinari)","Altre voci riconosciute\n(Spese COVID-19\nAnno 2021)",null,"Voci\nnon riconosciute",null,"Gestione MEDICAMENTI\ne materiale all'atto","Gestione TERAPIE all'atto\n(fisio-, ergoterapia, altre terapie)\nn",null,"Appartamenti\nper il personale","Bar e ristorante","Edicola","Negozio","Parrucchiere","Pedicure","Posteggi","Prestazioni di lavanderia a terzi","Vendita di pasti\na terzi","ESTR n",null,"Gestione straordinaria",null,"Centro di costo tecnico"]
["Voci di costo ",null,null,"+/-",null,null,null,null,null,null,null,null,null,null,null,null,null,null,null,null,null,null,null,null,null,null,null,null,null,null,null,null,null,null,null,null,null,null,null,null,null,null,null,null,null,null,null,null,null,null,null,null,null,null,null,null,null,null,null,null,null,null,"somma di controllo"]
[3000,"Salari medici",170000,null,{"$f":"C9+D9","v":170000},null,null,null,null,null,null,null,null,null,null,null,{"$f":"SUM(F9:P9)","v":0},null,null,null,null,null,null,20000,null,null,{"$f":"SUM(R9:Z9)","v":20000},150000,null,null,null,null,null,null,null,null,null,null,null,null,null,{"$f":"SUM(AB9:AO9)","v":150000},null,{"$f":"SUM(AQ9)","v":0},null,null,{"$f":"SUM(AS9:AT9)","v":0},null,null,null,null,null,null,null,null,null,null,{"$f":"SUM(AV9:BE9)","v":0},null,{"$f":"SUM(BG9)","v":0},null,null,{"$f":"IF(ABS(E9-Q9-AA9-AP9-AR9-AU9-BF9-BH9)<0.0001,0,E9-Q9-AA9-AP9-AR9-AU9-BF9-BH9)","v":0}]
[3001,"Salari responsabili di struttura",111000,null,{"$f":"C10+D10","v":111000},null,null,null,null,10000,null,null,null,null,null,null,{"$f":"SUM(F10:P10)","v":10000},null,1000,100000,null,null,null,null,null,null,{"$f":"SUM(R10:Z10)","v":101000},null,null,null,null,null,null,null,null,null,null,null,null,null,null,{"$f":"SUM(AB10:AO10)","v":0},null,{"$f":"SUM(AQ10)","v":0},null,null,{"$f":"SUM(AS10:AT10)","v":0},null,null,null,null,null,null,null,null,null,null,0,null,{"$f":"SUM(BG10)","v":0},null,null,{"$f":"IF(ABS(E10-Q10-AA10-AP10-AR10-AU10-BF10-BH10)<0.0001,0,E10-Q10-AA10-AP10-AR10-AU10-BF10-BH10)","v":0}]
[3001.05,"Salari capi reparto",199900,null,199900,null,null,null,null,9000,null,null,null,null,null,null,9000,null,900,90000,null,null,null,null,null,null,{"$f":"SUM(R11:Z11)","v":90900},100000,null,null,null,null,null,null,null,null,null,null,null,null,null,100000,null,0,null,null,0,null,null,null,null,null,null,null,null,null,null,0,null,0,null,null,0]
[3001.1,"Salari infermieri e operatori socio sanitari (OSS)",1705600,null,1705600,null,null,null,null,11600,null,null,null,56000,null,null,67600,null,35000,{"$f":"1160000","v":1160000},null,null,null,null,null,null,1195000,425000,null,null,null,null,null,null,null,null,null,null,null,null,18000,{"$f":"SUM(AB12:AO12)","v":443000},null,0,null,null,{"$f":"SUM(AS12:AT12)","v":0},null,null,null,null,null,null,null,null,null,null,{"$f":"SUM(AV12:BE12)","v":0},null,0,null,null,0]
[3001.2,"Salari assistenti e ausiliari di cura",1905000,null,1905000,null,null,null,null,null,null,57500,57500,115000,null,null,230000,null,55000,{"$f":"1150000","v":1150000},null,null,null,null,null,null,1205000,430000,null,null,null,null,null,null,null,null,null,null,null,null,40000,470000,null,0,null,null,0,null,null,null,null,null,null,null,null,null,null,0,null,0,null,null,0]
[3001.3,"Salari dietisti",44000,null,44000,null,null,null,null,4000,null,null,null,null,null,null,4000,null,null,null,null,null,40000,null,null,null,40000,null,null,null,null,null,null,null,null,null,null,null,null,null,null,0,null,0,null,null,0,null,null,null,null,null,null,null,null,null,null,0,null,0,null,null,{"$f":"IF(ABS(E14-Q14-AA14-AP14-AR14-AU14-BF14-BH14)<0.0001,0,E14-Q14-AA14-AP14-AR14-AU14-BF14-BH14)","v":0}]
[3001.9,"Salari personale di cura in formazione e stagisti",35500,null,35500,null,null,null,null,null,null,null,null,null,null,null,0,null,null,null,null,null,null,null,null,null,0,null,null,null,null,null,null,null,null,null,null,35000,null,null,500,35500,null,0,null,null,0,null,null,null,null,null,null,null,null,null,null,0,null,0,null,null,0]
[3002,"Salari personale altre discipline mediche specializzate",329000,null,329000,null,null,null,null,3500,null,null,null,null,null,null,3500,null,125000,null,10000,20000,null,null,null,null,155000,120000,null,null,null,null,null,null,null,null,null,null,null,null,500,120500,null,0,10000,40000,50000,null,null,null,null,null,null,null,null,null,null,0,null,0,null,null,0]
[3003,"Salari personale amministrativo",261500,null,261500,null,null,null,null,{"$f":"250000-12000","v":238000},null,null,null,null,null,null,238000,null,null,null,null,null,null,null,null,null,0,null,null,null,null,null,null,null,null,null,null,12000,null,null,11500,23500,null,0,null,null,0,null,null,null,null,null,null,null,null,null,null,0,null,0,null,null,0]
[3004,"Salari personale servizio alberghiero",945000,null,945000,null,null,null,null,null,55000,215000,200000,{"$f":"450000","v":450000},null,null,920000,null,null,null,null,null,null,null,null,null,0,null,null,null,null,null,null,null,null,null,null,null,null,null,25000,25000,null,0,null,null,0,null,null,null,null,null,null,null,null,null,null,0,null,0,null,null,0]
[3005,"Salari personale servizio tecnico",76000,null,76000,null,null,{"$f":"75000-6000","v":69000},null,null,null,null,null,null,null,null,69000,null,null,null,null,null,null,null,null,null,0,null,null,null,null,null,null,null,null,null,null,6000,null,null,1000,7000,null,0,null,null,0,null,null,null,null,null,null,null,null,null,null,0,null,0,null,null,0]
[3009,"Prestazioni continuative da parte di personale esterno",50000,null,50000,null,null,null,null,null,null,null,null,null,null,null,0,null,null,50000,null,null,null,null,null,null,50000,null,null,null,null,null,null,null,null,null,null,null,null,null,null,0,null,0,null,null,0,null,null,null,null,null,null,null,null,null,null,0,null,0,null,null,0]
[309,"Messa a disposizione di personale a terzi",0,null,0,null,null,null,null,null,null,null,null,null,null,null,0,null,null,null,null,null,null,null,null,null,0,null,null,null,null,null,null,null,null,null,null,null,null,null,null,0,null,0,null,null,0,null,null,null,null,null,null,null,null,null,null,0,null,0,null,null,0]
[37,"Oneri sociali",1340000,null,{"$f":"C22+D22","v":1340000},{"$f":"IF(Ripartizioni!$A$65=\"X\",Ripartizioni!F65,Ripartizioni!F66)","v":0},{"$f":"IF(Ripartizioni!$A$65=\"X\",Ripartizioni!G65,Ripartizioni!G66)","v":0},{"$f":"IF(Ripartizioni!$A$65=\"X\",Ripartizioni!H65,Ripartizioni!H66)","v":15989.623865110245},{"$f":"IF(Ripartizioni!$A$65=\"X\",Ripartizioni!I65,Ripartizioni!I66)","v":0},{"$f":"IF(Ripartizioni!$A$65=\"X\",Ripartizioni!J65,Ripartizioni!J66)","v":63981.668828361435},{"$f":"IF(Ripartizioni!$A$65=\"X\",Ripartizioni!K65,Ripartizioni!K66)","v":12745.352356247296},{"$f":"IF(Ripartizioni!$A$65=\"X\",Ripartizioni!L65,Ripartizioni!L66)","v":63147.427583225246},{"$f":"IF(Ripartizioni!$A$65=\"X\",Ripartizioni!M65,Ripartizioni!M66)","v":59671.422395157802},{"$f":"IF(Ripartizioni!$A$65=\"X\",Ripartizioni!N65,Ripartizioni!N66)","v":143906.61478599222},{"$f":"IF(Ripartizioni!$A$65=\"X\",Ripartizioni!O65,Ripartizioni!O66)","v":0},{"$f":"IF(Ripartizioni!$A$65=\"X\",Ripartizioni!P65,Ripartizioni!P66)","v":0},{"$f":"SUM(F22:P22)","v":359442.10981409426},{"$f":"IF(Ripartizioni!$A$65=\"X\",Ripartizioni!Q65,Ripartizioni!Q66)","v":0},{"$f":"IF(Ripartizioni!$A$65=\"X\",Ripartizioni!R65,Ripartizioni!R66)","v":50263.035019455252},{"$f":"IF(Ripartizioni!$A$65=\"X\",Ripartizioni!S65,Ripartizioni!S66)","v":579334.19801124081},{"$f":"IF(Ripartizioni!$A$65=\"X\",Ripartizioni!T65,Ripartizioni!T66)","v":2317.3367920449632},{"$f":"IF(Ripartizioni!$A$65=\"X\",Ripartizioni!U65,Ripartizioni!U66)","v":4634.6735840899264},{"$f":"IF(Ripartizioni!$A$65=\"X\",Ripartizioni!V65,Ripartizioni!V66)","v":9269.3471681798528},{"$f":"IF(Ripartizioni!$A$65=\"X\",Ripartizioni!W65,Ripartizioni!W66)","v":4634.6735840899264},{"$f":"IF(Ripartizioni!$A$65=\"X\",Ripartizioni!X65,Ripartizioni!X66)","v":0},{"$f":"IF(Ripartizioni!$A$65=\"X\",Ripartizioni!Y65,Ripartizioni!Y66)","v":0},650453.26415910071,{"$f":"IF(Ripartizioni!$A$65=\"X\",Ripartizioni!Z65,Ripartizioni!Z66)","v":283873.75702550798},null,{"$f":"IF(Ripartizioni!$A$65=\"X\",Ripartizioni!AB65,Ripartizioni!AB66)","v":0},{"$f":"IF(Ripartizioni!$A$65=\"X\",Ripartizioni!AC65,Ripartizioni!AC66)","v":0},{"$f":"IF(Ripartizioni!$A$65=\"X\",Ripartizioni!AD65,Ripartizioni!AD66)","v":0},{"$f":"IF(Ripartizioni!$A$65=\"X\",Ripartizioni!AE65,Ripartizioni!AE66)","v":0},{"$f":"IF(Ripartizioni!$A$65=\"X\",Ripartizioni!AF65,Ripartizioni!AF66)","v":0},{"$f":"IF(Ripartizioni!$A$65=\"X\",Ripartizioni!AG65,Ripartizioni!AG66)","v":0},{"$f":"IF(Ripartizioni!$A$65=\"X\",Ripartizioni!AH65,Ripartizioni!AH66)","v":0},{"$f":"IF(Ripartizioni!$A$65=\"X\",Ripartizioni!AI65,Ripartizioni!AI66)","v":0},{"$f":"IF(Ripartizioni!$A$65=\"X\",Ripartizioni!AJ65,Ripartizioni!AJ66)","v":12281.884997838306},{"$f":"IF(Ripartizioni!$A$65=\"X\",Ripartizioni!AK65,Ripartizioni!AK66)","v":0},{"$f":"IF(Ripartizioni!$A$65=\"X\",Ripartizioni!AL65,Ripartizioni!AL66)","v":0},{"$f":"IF(Ripartizioni!$A$65=\"X\",Ripartizioni!AM65,Ripartizioni!AM66)","v":22362.300043233896},318517.94206658017,{"$f":"IF(Ripartizioni!$A$65=\"X\",Ripartizioni!AN65,Ripartizioni!AN66)","v":0},0,{"$f":"IF(Ripartizioni!$A$65=\"X\",Ripartizioni!AO65,Ripartizioni!AO66)","v":2317.3367920449632},{"$f":"IF(Ripartizioni!$A$65=\"X\",Ripartizioni!AP65,Ripartizioni!AP66)","v":9269.3471681798528},11586.683960224816,{"$f":"IF(Ripartizioni!$A$65=\"X\",Ripartizioni!AQ65,Ripartizioni!AQ66)","v":0},{"$f":"IF(Ripartizioni!$A$65=\"X\",Ripartizioni!AR65,Ripartizioni!AR66)","v":0},{"$f":"IF(Ripartizioni!$A$65=\"X\",Ripartizioni!AS65,Ripartizioni!AS66)","v":0},{"$f":"IF(Ripartizioni!$A$65=\"X\",Ripartizioni!AT65,Ripartizioni!AT66)","v":0},{"$f":"IF(Ripartizioni!$A$65=\"X\",Ripartizioni!AU65,Ripartizioni!AU66)","v":0},{"$f":"IF(Ripartizioni!$A$65=\"X\",Ripartizioni!AV65,Ripartizioni!AV66)","v":0},{"$f":"IF(Ripartizioni!$A$65=\"X\",Ripartizioni!AW65,Ripartizioni!AW66)","v":0},{"$f":"IF(Ripartizioni!$A$65=\"X\",Ripartizioni!AX65,Ripartizioni!AX66)","v":0},{"$f":"IF(Ripartizioni!$A$65=\"X\",Ripartizioni!AY65,Ripartizioni!AY66)","v":0},{"$f":"IF(Ripartizioni!$A$65=\"X\",Ripartizioni!AZ65,Ripartizioni!AZ66)","v":0},0,{"$f":"IF(Ripartizioni!$A$65=\"X\",Ripartizioni!BA65,Ripartizioni!BA66)","v":0},0,null,null,0]
[null,"Neutralizzazione cassa pensione",0,null,{"$f":"C23+D23","v":0},null,null,null,null,null,null,null,null,null,null,null,{"$f":"SUM(F23:P23)","v":0},null,null,null,null,null,null,null,null,null,{"$f":"SUM(R23:Z23)","v":0},null,null,null,null,null,null,null,null,null,null,null,null,null,null,{"$f":"SUM(AB23:AO23)","v":0},null,{"$f":"SUM(AQ23)","v":0},null,null,{"$f":"SUM(AS23:AT23)","v":0},null,null,null,null,null,null,null,null,null,null,{"$f":"SUM(AV23:BE23)","v":0},null,{"$f":"SUM(BG23)","v":0},null,null,{"$f":"IF(ABS(E23-Q23-AA23-AP23-AR23-AU23-BF23-BH23)<0.0001,0,E23-Q23-AA23-AP23-AR23-AU23-BF23-BH23)","v":0}]
[38,"Onorari medici",25000,null,25000,null,null,null,null,null,null,null,null,null,null,null,{"$f":"SUM(F24:P24)","v":0},null,null,10000,null,null,null,null,null,null,10000,null,null,null,null,null,null,null,null,null,null,null,null,null,15000,15000,null,0,null,null,{"$f":"SUM(AS24:AT24)","v":0},null,null,null,null,null,null,null,null,null,null,0,null,0,null,null,0]
[39,"Altri costi del personale",38000,null,38000,null,null,500,null,1000,null,null,null,null,null,null,1500,null,500,15000,500,500,null,null,null,null,16500,null,null,null,null,null,null,null,null,null,null,null,null,null,20000,20000,null,0,null,null,0,null,null,null,null,null,null,null,null,null,null,0,null,0,null,null,0]
[40,"Fabbisogno medico",170100,null,170100,null,null,null,null,null,null,null,null,null,null,5000,5000,null,null,null,null,null,null,100,60000,15000,75100,25000,null,null,null,null,null,null,null,null,null,null,null,null,5000,30000,null,0,60000,null,60000,null,null,null,null,null,null,null,null,null,null,0,null,0,null,null,0]
[41,"Costi dei generi alimentari",250000,null,250000,null,null,null,null,null,null,null,null,{"$f":"250000","v":250000},null,null,250000,null,null,null,null,null,null,null,null,null,0,null,null,null,null,null,null,null,null,null,null,null,null,null,null,0,null,0,null,null,0,null,null,null,null,null,null,null,null,null,null,0,null,0,null,null,0]
[42,"Costi di economia domestica",126200,null,126200,null,null,1200,null,null,5000,15000,30000,25000,null,null,76200,25000,500,3000,250,250,null,null,null,null,29000,1000,null,null,null,null,null,null,null,null,null,null,null,null,20000,21000,null,0,null,null,0,null,null,null,null,null,null,null,null,null,null,0,null,0,null,null,0]
[43,"Manutenzione e riparazione",153049.99999999997,null,153049.99999999997,80000,3000,3000,8000,18000,2000,4000,500,13000,null,null,131500,2000,100,8000,150,150,null,null,null,null,10400,null,null,null,null,null,null,null,null,null,null,null,null,null,11000,11000,null,0,null,null,0,null,150,null,null,null,null,null,null,null,null,150,null,0,null,null,0]
[440,"Investimenti inferiori al limite di attivazione COAN",59500,null,59500,8500,null,null,null,10000,null,500,900,9000,null,null,{"$f":"SUM(F30:P30)","v":28900},5000,100,9500,500,500,null,null,null,null,15600,null,null,null,null,null,null,null,null,null,null,null,null,null,15000,15000,null,0,null,null,0,null,null,null,null,null,null,null,null,null,null,0,null,0,null,null,0]
[442,"Ammortamenti",755923.17999999993,null,755923.17999999993,null,null,null,null,null,null,null,null,null,null,null,0,null,null,null,null,null,null,null,null,null,0,null,null,null,null,null,null,null,null,null,{"$f":"755923.18-113388.48","v":642534.70000000007},null,null,null,null,642534.70000000007,113388.48,113388.48,null,null,0,null,null,null,null,null,null,null,null,null,null,0,0,0,null,null,0]
[443,"Canoni di locaz. per immobilizzaz. <  limite di attivazione COAN",0,null,0,null,null,null,null,null,null,null,null,null,null,null,0,null,null,null,null,null,null,null,null,null,0,null,null,null,null,null,null,null,null,null,null,null,null,null,null,0,null,0,null,null,0,null,null,null,null,null,null,null,null,null,null,0,null,0,null,null,0]
[444,"Canoni di locaz. per immobilizzaz. >= limite di attivazione COAN",1000,null,1000,null,null,null,null,1000,null,null,null,null,null,null,1000,null,null,null,null,null,null,null,null,null,0,null,null,null,null,null,null,null,null,null,null,null,null,null,null,0,null,0,null,null,0,null,null,null,null,null,null,null,null,null,null,0,null,0,null,null,0]
[448,"Interessi calcolatori sull'attivo fisso",0,578861.92000000004,578861.92000000004,null,null,null,null,null,null,null,null,null,null,null,0,null,null,null,null,null,null,null,null,null,0,null,null,null,null,null,null,null,null,null,{"$f":"578861.92-86829.29","v":492032.63000000006},null,null,null,null,492032.63000000006,86829.29,86829.29,null,null,0,null,null,null,null,null,null,null,null,null,null,0,0,0,null,null,0]
[45,"Costi per energia e acqua",116300,null,116300,null,115000,null,null,null,null,null,null,1300,null,null,116300,null,null,null,null,null,null,null,null,null,{"$f":"SUM(R35:Z35)","v":0},null,null,null,null,null,null,null,null,null,null,null,null,null,null,{"$f":"SUM(AB35:AO35)","v":0},null,{"$f":"SUM(AQ35)","v":0},null,null,{"$f":"SUM(AS35:AT35)","v":0},null,null,null,null,null,null,null,null,null,null,0,null,0,null,null,0]
[46,"Oneri finanziari",551111.92000000004,-549246.92000000004,{"$f":"C36+D36","v":1865},null,null,null,null,1865,null,null,null,null,null,null,1865,null,null,null,null,null,null,null,null,null,{"$f":"SUM(R36:Z36)","v":0},null,null,null,null,null,null,null,null,null,null,null,null,null,null,{"$f":"SUM(AB36:AO36)","v":0},null,{"$f":"SUM(AQ36)","v":0},null,null,{"$f":"SUM(AS36:AT36)","v":0},null,null,null,null,null,null,null,null,null,null,0,null,0,null,null,0]
[47,"Costi amministrativi e di informatica",66500,null,66500,null,null,null,null,65000,null,null,null,null,null,null,65000,null,null,500,250,250,null,null,null,null,{"$f":"SUM(R37:Z37)","v":1000},null,null,null,null,null,null,null,null,null,null,null,null,null,500,{"$f":"SUM(AB37:AO37)","v":500},null,{"$f":"SUM(AQ37)","v":0},null,null,{"$f":"SUM(AS37:AT37)","v":0},null,null,null,null,null,null,null,null,null,null,0,null,0,null,null,0]
[48,"Altri costi relativi ai residenti",10100,null,10100,null,null,null,null,1500,null,null,null,null,null,null,1500,5900,1500,null,null,null,null,null,null,null,{"$f":"SUM(R38:Z38)","v":7400},null,null,null,null,null,null,null,null,null,null,null,null,null,1200,{"$f":"SUM(AB38:AO38)","v":1200},null,{"$f":"SUM(AQ38)","v":0},null,null,{"$f":"SUM(AS38:AT38)","v":0},null,null,null,null,null,null,null,null,null,null,0,null,0,null,null,0]
[49,"Altri costi non relativi ai residenti",52500,null,52500,20000,null,null,null,10000,null,500,null,1500,null,null,32000,null,4500,500,300,200,null,null,null,null,{"$f":"SUM(R39:Z39)","v":5500},null,null,null,null,null,null,null,null,null,null,null,null,null,15000,{"$f":"SUM(AB39:AO39)","v":15000},null,{"$f":"SUM(AQ39)","v":0},null,null,{"$f":"SUM(AS39:AT39)","v":0},null,null,null,null,null,null,null,null,null,null,0,null,0,null,null,0]
[null,"Costi lordi prima delle ripartizioni",{"$f":"SUM(C9:C39)","v":9547785.0999999996},{"$f":"SUM(D9:D39)","v":29615},{"$f":"SUM(E9:E39)","v":9577400.0999999996},{"$f":"SUM(F9:F39)","v":108500},118000,89689.623865110247,8000,448446.66882836143,74745.352356247298,355647.42758322525,348571.4223951578,1064706.6147859921,0,5000,2621307.1098140944,37900,274363.03501945524,3175834.1980112409,14267.336792044964,26484.673584089927,49269.347168179855,24734.673584089927,60000,15000,3677853.2641591006,1534873.757025508,null,0,0,0,0,0,{"$f":"SUM(AI9:AI39)","v":0},0,1134567.33,65281.884997838308,0,0,221562.3000432339,2956285.2720665801,200217.77,200217.77,72317.336792044967,49269.347168179855,121586.68396022482,0,150,0,0,0,0,0,0,0,0,150,0,0]
["Riduzione dei costi, ricavi accessori compresi"]
[65,"Altri ricavi da prestazioni ai residenti",-23360,null,{"$f":"C42+D42","v":-23360},null,null,null,-5000,-8000,null,-300,null,-250,null,-10,{"$f":"SUM(F42:P42)","v":-13560},-800,-4000,0,0,0,0,0,0,0,{"$f":"SUM(R42:Z42)","v":-4800},null,null,null,null,null,null,null,null,null,null,null,null,null,null,{"$f":"SUM(AB42:AO42)","v":0},null,{"$f":"SUM(AQ42)","v":0},null,null,{"$f":"SUM(AS42:AT42)","v":0},null,-5000,null,null,null,null,null,null,null,null,{"$f":"SUM(AV42:BE42)","v":-5000},null,{"$f":"SUM(BG42)","v":0},null,null,{"$f":"IF(ABS(E42-Q42-AA42-AP42-AR42-AU42-BF42-BH42)<0.0001,0,E42-Q42-AA42-AP42-AR42-AU42-BF42-BH42)","v":0}]
[66,"Ricavi finanziari",-130,null,{"$f":"C43+D43","v":-130},null,null,null,null,-130,null,null,null,null,null,null,{"$f":"SUM(F43:P43)","v":-130},null,null,null,null,null,null,null,null,null,{"$f":"SUM(R43:Z43)","v":0},null,null,null,null,null,null,null,null,null,null,null,null,null,null,{"$f":"SUM(AB43:AO43)","v":0},null,{"$f":"SUM(AQ43)","v":0},null,null,{"$f":"SUM(AS43:AT43)","v":0},null,null,null,null,null,null,null,null,null,null,{"$f":"SUM(AV43:BE43)","v":0},null,{"$f":"SUM(BG43)","v":0},null,null,{"$f":"IF(ABS(E43-Q43-AA43-AP43-AR43-AU43-BF43-BH43)<0.0001,0,E43-Q43-AA43-AP43-AR43-AU43-BF43-BH43)","v":0}]
[68,"Ricavi da prestazioni fornite al personale e a terzi",-28550,null,{"$f":"C44+D44","v":-28550},null,null,null,null,-100,null,-150,null,-300,null,null,{"$f":"SUM(F44:P44)","v":-550},null,null,null,null,null,null,null,null,null,{"$f":"SUM(R44:Z44)","v":0},null,null,null,null,null,null,null,null,null,null,null,null,null,null,{"$f":"SUM(AB44:AO44)","v":0},null,{"$f":"SUM(AQ44)","v":0},null,null,{"$f":"SUM(AS44:AT44)","v":0},null,-9000,null,null,null,null,-4000,null,-15000,null,{"$f":"SUM(AV44:BE44)","v":-28000},null,{"$f":"SUM(BG44)","v":0},null,null,{"$f":"IF(ABS(E44-Q44-AA44-AP44-AR44-AU44-BF44-BH44)<0.0001,0,E44-Q44-AA44-AP44-AR44-AU44-BF44-BH44)","v":0}]
[7,"Imposte, risultato estraneo all'esercizio e straordinario",-500,null,{"$f":"C45+D45","v":-500},null,null,null,null,-500,null,null,null,null,null,null,{"$f":"SUM(F45:P45)","v":-500},null,null,null,null,null,null,null,null,null,{"$f":"SUM(R45:Z45)","v":0},null,null,null,null,null,null,null,null,null,null,null,null,null,null,{"$f":"SUM(AB45:AO45)","v":0},null,{"$f":"SUM(AQ45)","v":0},null,null,{"$f":"SUM(AS45:AT45)","v":0},null,null,null,null,null,null,null,null,null,null,{"$f":"SUM(AV45:BE45)","v":0},null,{"$f":"SUM(BG45)","v":0},null,null,{"$f":"IF(ABS(E45-Q45-AA45-AP45-AR45-AU45-BF45-BH45)<0.0001,0,E45-Q45-AA45-AP45-AR45-AU45-BF45-BH45)","v":0}]
[null,"Costi netti prima delle ripartizioni ",{"$f":"SUM(C40:C45)","v":9495245.0999999996},{"$f":"SUM(D40:D45)","v":29615},{"$f":"SUM(E40:E45)","v":9524860.0999999996},108500,118000,89689.623865110247,3000,439716.66882836143,74745.352356247298,355197.42758322525,348571.4223951578,1064156.6147859921,0,4990,2606567.1098140944,37100,270363.03501945524,3175834.1980112409,14267.336792044964,26484.673584089927,49269.347168179855,24734.673584089927,60000,15000,3673053.2641591006,1534873.757025508,null,0,0,0,0,0,0,0,1134567.33,65281.884997838308,0,0,221562.3000432339,2956285.2720665801,200217.77,200217.77,72317.336792044967,49269.347168179855,121586.68396022482,0,-13850,0,0,0,0,-4000,0,-15000,0,-32850,0,0]
["Ripartizioni sui CdC generali e sui CdC principali",null,"Unità","Totale","Prezzo/unità"]
["RIP010","Ripartizione Edifici",{"$f":"Ripartizioni!C32","v":"m2"},{"$f":"Ripartizioni!E32","v":4590},{"$f":"Ripartizioni!E47","v":23.63834422657952},{"$f":"-SUM(F46,F49:F58)","v":-108500},{"$f":"Ripartizioni!$E47*Ripartizioni!G32","v":1772.875816993464},{"$f":"Ripartizioni!$E47*Ripartizioni!H32","v":1181.917211328976},{"$f":"Ripartizioni!$E47*Ripartizioni!I32","v":0},{"$f":"Ripartizioni!$E47*Ripartizioni!J32","v":2363.834422657952},{"$f":"Ripartizioni!$E47*Ripartizioni!K32","v":1891.0675381263616},{"$f":"Ripartizioni!$E47*Ripartizioni!L32","v":2363.834422657952},{"$f":"Ripartizioni!$E47*Ripartizioni!M32","v":1063.7254901960785},{"$f":"Ripartizioni!$E47*Ripartizioni!N32","v":7564.2701525054463},{"$f":"Ripartizioni!$E47*Ripartizioni!O32","v":0},{"$f":"Ripartizioni!$E47*Ripartizioni!P32","v":0},{"$f":"SUM(F48:P48)","v":-90298.474945533773},{"$f":"Ripartizioni!$E47*Ripartizioni!Q32","v":59095.860566448799},{"$f":"Ripartizioni!$E47*Ripartizioni!R32","v":2836.6013071895422},{"$f":"Ripartizioni!$E47*Ripartizioni!S32","v":2363.834422657952},{"$f":"Ripartizioni!$E47*Ripartizioni!T32","v":472.76688453159039},{"$f":"Ripartizioni!$E47*Ripartizioni!U32","v":590.958605664488},{"$f":"Ripartizioni!$E47*Ripartizioni!V32","v":0},{"$f":"Ripartizioni!$E47*Ripartizioni!W32","v":0},{"$f":"Ripartizioni!$E47*Ripartizioni!X32","v":0},{"$f":"Ripartizioni!$E47*Ripartizioni!Y32","v":0},{"$f":"SUM(R48:Z48)","v":65360.021786492376},{"$f":"Ripartizioni!$E47*Ripartizioni!Z32","v":20092.592592592591},null,{"$f":"Ripartizioni!$E47*Ripartizioni!AB32","v":0},{"$f":"Ripartizioni!$E47*Ripartizioni!AC32","v":0},{"$f":"Ripartizioni!$E47*Ripartizioni!AD32","v":0},{"$f":"Ripartizioni!$E47*Ripartizioni!AE32","v":0},{"$f":"Ripartizioni!$E47*Ripartizioni!AF32","v":0},{"$f":"Ripartizioni!$E47*Ripartizioni!AG32","v":0},{"$f":"Ripartizioni!$E47*Ripartizioni!AH32","v":0},null,null,null,null,null,{"$f":"SUM(AB48:AO48)","v":20092.592592592591},null,{"$f":"SUM(AQ48)","v":0},{"$f":"Ripartizioni!$E47*Ripartizioni!AO32","v":236.3834422657952},{"$f":"Ripartizioni!$E47*Ripartizioni!AP32","v":1063.7254901960785},{"$f":"SUM(AS48:AT48)","v":1300.1089324618736},{"$f":"Ripartizioni!$E47*Ripartizioni!AQ32","v":0},{"$f":"Ripartizioni!$E47*Ripartizioni!AR32","v":3545.751633986928},{"$f":"Ripartizioni!$E47*Ripartizioni!AS32","v":0},{"$f":"Ripartizioni!$E47*Ripartizioni!AT32","v":0},{"$f":"Ripartizioni!$E47*Ripartizioni!AU32","v":0},{"$f":"Ripartizioni!$E47*Ripartizioni!AV32","v":0},{"$f":"Ripartizioni!$E47*Ripartizioni!AW32","v":0},{"$f":"Ripartizioni!$E47*Ripartizioni!AX32","v":0},{"$f":"Ripartizioni!$E47*Ripartizioni!AY32","v":0},{"$f":"Ripartizioni!$E47*Ripartizioni!AZ32","v":0},{"$f":"SUM(AV48:BE48)","v":3545.751633986928},{"$f":"Ripartizioni!$E47*Ripartizioni!BA32","v":0},{"$f":"SUM(BG48)","v":0},null,null,{"$f":"IF(ABS(Q48+AA48+AP48+AR48+AU48+BF48+BH48)<0.0001,0,Q48+AA48+AP48+AR48+AU48+BF48+BH48)","v":0}]
["RIP011","Ripartizione Energia",{"$f":"Ripartizioni!C33","v":"m2"},{"$f":"Ripartizioni!E33","v":4515},{"$f":"Ripartizioni!E48","v":28.367705311309226},{"$f":"Ripartizioni!$E48*Ripartizioni!F33","v":0},{"$f":"-SUM(G46,G48,G50:G58)","v":-128080.18948056115},{"$f":"Ripartizioni!$E48*Ripartizioni!H33","v":1418.3852655654614},{"$f":"Ripartizioni!$E48*Ripartizioni!I33","v":0},{"$f":"Ripartizioni!$E48*Ripartizioni!J33","v":2836.7705311309228},{"$f":"Ripartizioni!$E48*Ripartizioni!K33","v":2269.4164249047381},{"$f":"Ripartizioni!$E48*Ripartizioni!L33","v":2836.7705311309228},{"$f":"Ripartizioni!$E48*Ripartizioni!M33","v":1276.5467390089152},{"$f":"Ripartizioni!$E48*Ripartizioni!N33","v":9077.6656996189522},{"$f":"Ripartizioni!$E48*Ripartizioni!O33","v":0},{"$f":"Ripartizioni!$E48*Ripartizioni!P33","v":0},{"$f":"SUM(F49:P49)","v":-108364.63428920123},{"$f":"Ripartizioni!$E48*Ripartizioni!Q33","v":70919.263278273065},{"$f":"Ripartizioni!$E48*Ripartizioni!R33","v":3404.1246373571071},{"$f":"Ripartizioni!$E48*Ripartizioni!S33","v":2836.7705311309228},{"$f":"Ripartizioni!$E48*Ripartizioni!T33","v":567.35410622618451},{"$f":"Ripartizioni!$E48*Ripartizioni!U33","v":709.1926327827307},{"$f":"Ripartizioni!$E48*Ripartizioni!V33","v":0},{"$f":"Ripartizioni!$E48*Ripartizioni!W33","v":0},{"$f":"Ripartizioni!$E48*Ripartizioni!X33","v":0},{"$f":"Ripartizioni!$E48*Ripartizioni!Y33","v":0},{"$f":"SUM(R49:Z49)","v":78436.705185769999},{"$f":"Ripartizioni!$E48*Ripartizioni!Z33","v":24112.549514612841},null,{"$f":"Ripartizioni!$E48*Ripartizioni!AB33","v":0},{"$f":"Ripartizioni!$E48*Ripartizioni!AC33","v":0},{"$f":"Ripartizioni!$E48*Ripartizioni!AD33","v":0},{"$f":"Ripartizioni!$E48*Ripartizioni!AE33","v":0},{"$f":"Ripartizioni!$E48*Ripartizioni!AF33","v":0},{"$f":"Ripartizioni!$E48*Ripartizioni!AG33","v":0},{"$f":"Ripartizioni!$E48*Ripartizioni!AH33","v":0},null,null,null,null,null,{"$f":"SUM(AB49:AO49)","v":24112.549514612841},null,{"$f":"SUM(AQ49)","v":0},{"$f":"Ripartizioni!$E48*Ripartizioni!AO33","v":283.67705311309226},{"$f":"Ripartizioni!$E48*Ripartizioni!AP33","v":1276.5467390089152},{"$f":"SUM(AS49:AT49)","v":1560.2237921220076},{"$f":"Ripartizioni!$E48*Ripartizioni!AQ33","v":0},{"$f":"Ripartizioni!$E48*Ripartizioni!AR33","v":4255.1557966963837},{"$f":"Ripartizioni!$E48*Ripartizioni!AS33","v":0},{"$f":"Ripartizioni!$E48*Ripartizioni!AT33","v":0},{"$f":"Ripartizioni!$E48*Ripartizioni!AU33","v":0},{"$f":"Ripartizioni!$E48*Ripartizioni!AV33","v":0},{"$f":"Ripartizioni!$E48*Ripartizioni!AW33","v":0},{"$f":"Ripartizioni!$E48*Ripartizioni!AX33","v":0},{"$f":"Ripartizioni!$E48*Ripartizioni!AY33","v":0},{"$f":"Ripartizioni!$E48*Ripartizioni!AZ33","v":0},{"$f":"SUM(AV49:BE49)","v":4255.1557966963837},{"$f":"Ripartizioni!$E48*Ripartizioni!BA33","v":0},{"$f":"SUM(BG49)","v":0},null,null,{"$f":"IF(ABS(Q49+AA49+AP49+AR49+AU49+BF49+BH49)<0.0001,0,Q49+AA49+AP49+AR49+AU49+BF49+BH49)","v":0}]
["RIP020","Ripartizione Servizi tecnici",{"$f":"Ripartizioni!C34","v":"m2"},{"$f":"Ripartizioni!E34","v":4540},{"$f":"Ripartizioni!E49","v":23.303822918720929},{"$f":"Ripartizioni!$E49*Ripartizioni!F34","v":0},{"$f":"Ripartizioni!$E49*Ripartizioni!G34","v":1747.7867189040696},{"$f":"-SUM(H46,H48:H49,H51:H58)","v":-105799.35605099301},{"$f":"Ripartizioni!$E49*Ripartizioni!I34","v":0},{"$f":"Ripartizioni!$E49*Ripartizioni!J34","v":2330.382291872093},{"$f":"Ripartizioni!$E49*Ripartizioni!K34","v":1864.3058334976743},{"$f":"Ripartizioni!$E49*Ripartizioni!L34","v":2330.382291872093},{"$f":"Ripartizioni!$E49*Ripartizioni!M34","v":1048.6720313424419},{"$f":"Ripartizioni!$E49*Ripartizioni!N34","v":7457.223333990697},{"$f":"Ripartizioni!$E49*Ripartizioni!O34","v":0},{"$f":"Ripartizioni!$E49*Ripartizioni!P34","v":0},{"$f":"SUM(F50:P50)","v":-89020.603549513922},{"$f":"Ripartizioni!$E49*Ripartizioni!Q34","v":58259.557296802319},{"$f":"Ripartizioni!$E49*Ripartizioni!R34","v":2796.4587502465115},{"$f":"Ripartizioni!$E49*Ripartizioni!S34","v":2330.382291872093},{"$f":"Ripartizioni!$E49*Ripartizioni!T34","v":466.07645837441856},{"$f":"Ripartizioni!$E49*Ripartizioni!U34","v":582.59557296802325},{"$f":"Ripartizioni!$E49*Ripartizioni!V34","v":0},{"$f":"Ripartizioni!$E49*Ripartizioni!W34","v":0},{"$f":"Ripartizioni!$E49*Ripartizioni!X34","v":0},{"$f":"Ripartizioni!$E49*Ripartizioni!Y34","v":0},64435.070370263362,{"$f":"Ripartizioni!$E49*Ripartizioni!Z34","v":19808.249480912789},null,{"$f":"Ripartizioni!$E49*Ripartizioni!AB34","v":0},{"$f":"Ripartizioni!$E49*Ripartizioni!AC34","v":0},{"$f":"Ripartizioni!$E49*Ripartizioni!AD34","v":0},{"$f":"Ripartizioni!$E49*Ripartizioni!AE34","v":0},{"$f":"Ripartizioni!$E49*Ripartizioni!AF34","v":0},{"$f":"Ripartizioni!$E49*Ripartizioni!AG34","v":0},{"$f":"Ripartizioni!$E49*Ripartizioni!AH34","v":0},null,null,null,null,null,19808.249480912789,null,0,{"$f":"Ripartizioni!$E49*Ripartizioni!AO34","v":233.03822918720928},{"$f":"Ripartizioni!$E49*Ripartizioni!AP34","v":1048.6720313424419},1281.7102605296511,{"$f":"Ripartizioni!$E49*Ripartizioni!AQ34","v":0},{"$f":"Ripartizioni!$E49*Ripartizioni!AR34","v":3495.5734378081393},{"$f":"Ripartizioni!$E49*Ripartizioni!AS34","v":0},{"$f":"Ripartizioni!$E49*Ripartizioni!AT34","v":0},{"$f":"Ripartizioni!$E49*Ripartizioni!AU34","v":0},{"$f":"Ripartizioni!$E49*Ripartizioni!AV34","v":0},{"$f":"Ripartizioni!$E49*Ripartizioni!AW34","v":0},{"$f":"Ripartizioni!$E49*Ripartizioni!AX34","v":0},{"$f":"Ripartizioni!$E49*Ripartizioni!AY34","v":0},{"$f":"Ripartizioni!$E49*Ripartizioni!AZ34","v":0},3495.5734378081393,{"$f":"Ripartizioni!$E49*Ripartizioni!BA34","v":0},0,null,null,0]
["RIP021","Ripartizione Servizio trasporti",{"$f":"Ripartizioni!C35","v":"km (sistematico)"},{"$f":"Ripartizioni!E35","v":1900},{"$f":"Ripartizioni!E50","v":1.5789473684210527},{"$f":"Ripartizioni!$E50*Ripartizioni!F35","v":0},{"$f":"Ripartizioni!$E50*Ripartizioni!G35","v":0},{"$f":"Ripartizioni!$E50*Ripartizioni!H35","v":157.89473684210526},{"$f":"-SUM(I46,I48:I50,I52:I58)","v":-3000},{"$f":"Ripartizioni!$E50*Ripartizioni!J35","v":1736.8421052631579},{"$f":"Ripartizioni!$E50*Ripartizioni!K35","v":0},{"$f":"Ripartizioni!$E50*Ripartizioni!L35","v":0},{"$f":"Ripartizioni!$E50*Ripartizioni!M35","v":0},{"$f":"Ripartizioni!$E50*Ripartizioni!N35","v":78.94736842105263},{"$f":"Ripartizioni!$E50*Ripartizioni!O35","v":0},{"$f":"Ripartizioni!$E50*Ripartizioni!P35","v":0},{"$f":"SUM(F51:P51)","v":-1026.3157894736839},{"$f":"Ripartizioni!$E50*Ripartizioni!Q35","v":0},{"$f":"Ripartizioni!$E50*Ripartizioni!R35","v":236.84210526315789},{"$f":"Ripartizioni!$E50*Ripartizioni!S35","v":789.47368421052636},{"$f":"Ripartizioni!$E50*Ripartizioni!T35","v":0},{"$f":"Ripartizioni!$E50*Ripartizioni!U35","v":0},{"$f":"Ripartizioni!$E50*Ripartizioni!V35","v":0},{"$f":"Ripartizioni!$E50*Ripartizioni!W35","v":0},{"$f":"Ripartizioni!$E50*Ripartizioni!X35","v":0},{"$f":"Ripartizioni!$E50*Ripartizioni!Y35","v":0},1026.3157894736842,{"$f":"Ripartizioni!$E50*Ripartizioni!Z35","v":0},null,{"$f":"Ripartizioni!$E50*Ripartizioni!AB35","v":0},{"$f":"Ripartizioni!$E50*Ripartizioni!AC35","v":0},{"$f":"Ripartizioni!$E50*Ripartizioni!AD35","v":0},{"$f":"Ripartizioni!$E50*Ripartizioni!AE35","v":0},{"$f":"Ripartizioni!$E50*Ripartizioni!AF35","v":0},{"$f":"Ripartizioni!$E50*Ripartizioni!AG35","v":0},{"$f":"Ripartizioni!$E50*Ripartizioni!AH35","v":0},null,null,null,null,null,0,null,0,{"$f":"Ripartizioni!$E50*Ripartizioni!AO35","v":0},{"$f":"Ripartizioni!$E50*Ripartizioni!AP35","v":0},0,{"$f":"Ripartizioni!$E50*Ripartizioni!AQ35","v":0},{"$f":"Ripartizioni!$E50*Ripartizioni!AR35","v":0},{"$f":"Ripartizioni!$E50*Ripartizioni!AS35","v":0},{"$f":"Ripartizioni!$E50*Ripartizioni!AT35","v":0},{"$f":"Ripartizioni!$E50*Ripartizioni!AU35","v":0},{"$f":"Ripartizioni!$E50*Ripartizioni!AV35","v":0},{"$f":"Ripartizioni!$E50*Ripartizioni!AW35","v":0},{"$f":"Ripartizioni!$E50*Ripartizioni!AX35","v":0},{"$f":"Ripartizioni!$E50*Ripartizioni!AY35","v":0},{"$f":"Ripartizioni!$E50*Ripartizioni!AZ35","v":0},0,{"$f":"Ripartizioni!$E50*Ripartizioni!BA35","v":0},0,null,null,0]
["RIP030","Ripartizione Direzione / Amministrazione",{"$f":"Ripartizioni!C36","v":"% retribuzione"},{"$f":"Ripartizioni!E36","v":0.92702957565366495},{"$f":"Ripartizioni!E51","v":498755.60516552679},{"$f":"Ripartizioni!$E51*Ripartizioni!F36","v":0},{"$f":"Ripartizioni!$E51*Ripartizioni!G36","v":0},{"$f":"Ripartizioni!$E51*Ripartizioni!H36","v":5900.4092167031895},{"$f":"Ripartizioni!$E51*Ripartizioni!I36","v":0},{"$f":"-SUM(J46,J48:J51,J53:J58)","v":-462361.19701148517},{"$f":"Ripartizioni!$E51*Ripartizioni!K36","v":4703.2247379518176},{"$f":"Ripartizioni!$E51*Ripartizioni!L36","v":23302.340747124912},{"$f":"Ripartizioni!$E51*Ripartizioni!M36","v":22019.643091319871},{"$f":"Ripartizioni!$E51*Ripartizioni!N36","v":53103.682950328701},{"$f":"Ripartizioni!$E51*Ripartizioni!O36","v":0},{"$f":"Ripartizioni!$E51*Ripartizioni!P36","v":0},-353331.89626805665,{"$f":"Ripartizioni!$E51*Ripartizioni!Q36","v":0},{"$f":"Ripartizioni!$E51*Ripartizioni!R36","v":18547.808102940893},{"$f":"Ripartizioni!$E51*Ripartizioni!S36","v":218058.60148685699},{"$f":"Ripartizioni!$E51*Ripartizioni!T36","v":855.13177053669403},{"$f":"Ripartizioni!$E51*Ripartizioni!U36","v":1710.2635410733881},{"$f":"Ripartizioni!$E51*Ripartizioni!V36","v":3420.5270821467761},{"$f":"Ripartizioni!$E51*Ripartizioni!W36","v":1710.2635410733881},{"$f":"Ripartizioni!$E51*Ripartizioni!X36","v":0},{"$f":"Ripartizioni!$E51*Ripartizioni!Y36","v":0},244302.59552462815,{"$f":"Ripartizioni!$E51*Ripartizioni!Z36","v":104753.64189074503},null,{"$f":"Ripartizioni!$E51*Ripartizioni!AB36","v":0},{"$f":"Ripartizioni!$E51*Ripartizioni!AC36","v":0},{"$f":"Ripartizioni!$E51*Ripartizioni!AD36","v":0},{"$f":"Ripartizioni!$E51*Ripartizioni!AE36","v":0},{"$f":"Ripartizioni!$E51*Ripartizioni!AF36","v":0},{"$f":"Ripartizioni!$E51*Ripartizioni!AG36","v":0},{"$f":"Ripartizioni!$E51*Ripartizioni!AH36","v":0},null,null,null,null,null,104753.64189074503,null,0,{"$f":"Ripartizioni!$E51*Ripartizioni!AO36","v":855.13177053669403},{"$f":"Ripartizioni!$E51*Ripartizioni!AP36","v":3420.5270821467761},4275.6588526834703,{"$f":"Ripartizioni!$E51*Ripartizioni!AQ36","v":0},{"$f":"Ripartizioni!$E51*Ripartizioni!AR36","v":0},{"$f":"Ripartizioni!$E51*Ripartizioni!AS36","v":0},{"$f":"Ripartizioni!$E51*Ripartizioni!AT36","v":0},{"$f":"Ripartizioni!$E51*Ripartizioni!AU36","v":0},{"$f":"Ripartizioni!$E51*Ripartizioni!AV36","v":0},{"$f":"Ripartizioni!$E51*Ripartizioni!AW36","v":0},{"$f":"Ripartizioni!$E51*Ripartizioni!AX36","v":0},{"$f":"Ripartizioni!$E51*Ripartizioni!AY36","v":0},{"$f":"Ripartizioni!$E51*Ripartizioni!AZ36","v":0},0,{"$f":"Ripartizioni!$E51*Ripartizioni!BA36","v":0},0,null,null,0]
["RIP040","Ripartizione Economia domestica in generale",{"$f":"Ripartizioni!C37","v":"% retribuzione"},{"$f":"Ripartizioni!E37","v":0.96493784826403772},{"$f":"Ripartizioni!E52","v":97820.867074020018},{"$f":"Ripartizioni!$E52*Ripartizioni!F37","v":0},{"$f":"Ripartizioni!$E52*Ripartizioni!G37","v":0},{"$f":"Ripartizioni!$E52*Ripartizioni!H37","v":1157.2464343090239},{"$f":"Ripartizioni!$E52*Ripartizioni!I37","v":0},{"$f":"Ripartizioni!$E52*Ripartizioni!J37","v":4630.6629059814704},{"$f":"-SUM(K46,K48:K52,K54:K58)","v":-94391.056989727338},{"$f":"Ripartizioni!$E52*Ripartizioni!L37","v":4570.2848311479565},{"$f":"Ripartizioni!$E52*Ripartizioni!M37","v":4318.7095193416462},{"$f":"Ripartizioni!$E52*Ripartizioni!N37","v":10415.217908781215},{"$f":"Ripartizioni!$E52*Ripartizioni!O37","v":0},{"$f":"Ripartizioni!$E52*Ripartizioni!P37","v":0},-69298.935390166022,{"$f":"Ripartizioni!$E52*Ripartizioni!Q37","v":0},{"$f":"Ripartizioni!$E52*Ripartizioni!R37","v":3637.7790087192357},{"$f":"Ripartizioni!$E52*Ripartizioni!S37","v":42767.803007072616},{"$f":"Ripartizioni!$E52*Ripartizioni!T37","v":167.71687453753967},{"$f":"Ripartizioni!$E52*Ripartizioni!U37","v":335.43374907507933},{"$f":"Ripartizioni!$E52*Ripartizioni!V37","v":670.86749815015867},{"$f":"Ripartizioni!$E52*Ripartizioni!W37","v":335.43374907507933},{"$f":"Ripartizioni!$E52*Ripartizioni!X37","v":0},{"$f":"Ripartizioni!$E52*Ripartizioni!Y37","v":0},47915.033886629702,{"$f":"Ripartizioni!$E52*Ripartizioni!Z37","v":20545.317130848613},null,{"$f":"Ripartizioni!$E52*Ripartizioni!AB37","v":0},{"$f":"Ripartizioni!$E52*Ripartizioni!AC37","v":0},{"$f":"Ripartizioni!$E52*Ripartizioni!AD37","v":0},{"$f":"Ripartizioni!$E52*Ripartizioni!AE37","v":0},{"$f":"Ripartizioni!$E52*Ripartizioni!AF37","v":0},{"$f":"Ripartizioni!$E52*Ripartizioni!AG37","v":0},{"$f":"Ripartizioni!$E52*Ripartizioni!AH37","v":0},null,null,null,null,null,20545.317130848613,null,0,{"$f":"Ripartizioni!$E52*Ripartizioni!AO37","v":167.71687453753967},{"$f":"Ripartizioni!$E52*Ripartizioni!AP37","v":670.86749815015867},838.58437268769831,{"$f":"Ripartizioni!$E52*Ripartizioni!AQ37","v":0},{"$f":"Ripartizioni!$E52*Ripartizioni!AR37","v":0},{"$f":"Ripartizioni!$E52*Ripartizioni!AS37","v":0},{"$f":"Ripartizioni!$E52*Ripartizioni!AT37","v":0},{"$f":"Ripartizioni!$E52*Ripartizioni!AU37","v":0},{"$f":"Ripartizioni!$E52*Ripartizioni!AV37","v":0},{"$f":"Ripartizioni!$E52*Ripartizioni!AW37","v":0},{"$f":"Ripartizioni!$E52*Ripartizioni!AX37","v":0},{"$f":"Ripartizioni!$E52*Ripartizioni!AY37","v":0},{"$f":"Ripartizioni!$E52*Ripartizioni!AZ37","v":0},0,{"$f":"Ripartizioni!$E52*Ripartizioni!BA37","v":0},0,null,null,0]
["RIP041","Ripartizione Lavanderia",{"$f":"Ripartizioni!C38","v":"kg (sistematico)"},{"$f":"Ripartizioni!E38","v":41580},{"$f":"Ripartizioni!E53","v":9.6043067901245127},{"$f":"Ripartizioni!$E53*Ripartizioni!F38","v":0},{"$f":"Ripartizioni!$E53*Ripartizioni!G38","v":0},{"$f":"Ripartizioni!$E53*Ripartizioni!H38","v":1920.8613580249025},{"$f":"Ripartizioni!$E53*Ripartizioni!I38","v":0},{"$f":"Ripartizioni!$E53*Ripartizioni!J38","v":0},{"$f":"Ripartizioni!$E53*Ripartizioni!K38","v":1920.8613580249025},{"$f":"-SUM(L46,L48:L53,L55:L58)","v":-399347.07633337722},{"$f":"Ripartizioni!$E53*Ripartizioni!M38","v":19208.613580249024},{"$f":"Ripartizioni!$E53*Ripartizioni!N38","v":11525.168148149416},{"$f":"Ripartizioni!$E53*Ripartizioni!O38","v":0},{"$f":"Ripartizioni!$E53*Ripartizioni!P38","v":0},-364771.571888929,{"$f":"Ripartizioni!$E53*Ripartizioni!Q38","v":249711.97654323734},{"$f":"Ripartizioni!$E53*Ripartizioni!R38","v":1920.8613580249025},{"$f":"Ripartizioni!$E53*Ripartizioni!S38","v":28812.920370373537},{"$f":"Ripartizioni!$E53*Ripartizioni!T38","v":384.17227160498049},{"$f":"Ripartizioni!$E53*Ripartizioni!U38","v":480.21533950622563},{"$f":"Ripartizioni!$E53*Ripartizioni!V38","v":0},{"$f":"Ripartizioni!$E53*Ripartizioni!W38","v":0},{"$f":"Ripartizioni!$E53*Ripartizioni!X38","v":0},{"$f":"Ripartizioni!$E53*Ripartizioni!Y38","v":0},281310.14588274702,{"$f":"Ripartizioni!$E53*Ripartizioni!Z38","v":82597.038395070806},null,{"$f":"Ripartizioni!$E53*Ripartizioni!AB38","v":0},{"$f":"Ripartizioni!$E53*Ripartizioni!AC38","v":0},{"$f":"Ripartizioni!$E53*Ripartizioni!AD38","v":0},{"$f":"Ripartizioni!$E53*Ripartizioni!AE38","v":0},{"$f":"Ripartizioni!$E53*Ripartizioni!AF38","v":0},{"$f":"Ripartizioni!$E53*Ripartizioni!AG38","v":0},{"$f":"Ripartizioni!$E53*Ripartizioni!AH38","v":0},null,null,null,null,null,82597.038395070806,null,0,{"$f":"Ripartizioni!$E53*Ripartizioni!AO38","v":0},{"$f":"Ripartizioni!$E53*Ripartizioni!AP38","v":864.38761111120618},864.38761111120618,{"$f":"Ripartizioni!$E53*Ripartizioni!AQ38","v":0},{"$f":"Ripartizioni!$E53*Ripartizioni!AR38","v":0},{"$f":"Ripartizioni!$E53*Ripartizioni!AS38","v":0},{"$f":"Ripartizioni!$E53*Ripartizioni!AT38","v":0},{"$f":"Ripartizioni!$E53*Ripartizioni!AU38","v":0},{"$f":"Ripartizioni!$E53*Ripartizioni!AV38","v":0},{"$f":"Ripartizioni!$E53*Ripartizioni!AW38","v":0},{"$f":"Ripartizioni!$E53*Ripartizioni!AX38","v":0},{"$f":"Ripartizioni!$E53*Ripartizioni!AY38","v":0},{"$f":"Ripartizioni!$E53*Ripartizioni!AZ38","v":0},0,{"$f":"Ripartizioni!$E53*Ripartizioni!BA38","v":0},0,null,null,0]
["RIP042","Ripartizione Pulizie",{"$f":"Ripartizioni!C39","v":"m2"},{"$f":"Ripartizioni!E39","v":4545},{"$f":"Ripartizioni!E54","v":87.460359262181697},{"$f":"Ripartizioni!$E54*Ripartizioni!F39","v":0},{"$f":"Ripartizioni!$E54*Ripartizioni!G39","v":6559.5269446636275},{"$f":"Ripartizioni!$E54*Ripartizioni!H39","v":4373.017963109085},{"$f":"Ripartizioni!$E54*Ripartizioni!I39","v":0},{"$f":"Ripartizioni!$E54*Ripartizioni!J39","v":8746.0359262181701},{"$f":"Ripartizioni!$E54*Ripartizioni!K39","v":6996.8287409745353},{"$f":"Ripartizioni!$E54*Ripartizioni!L39","v":8746.0359262181701},{"$f":"-SUM(M46,M48:M54,M56:M58)","v":-397507.33284661581},{"$f":"Ripartizioni!$E54*Ripartizioni!N39","v":27987.314963898141},{"$f":"Ripartizioni!$E54*Ripartizioni!O39","v":0},{"$f":"Ripartizioni!$E54*Ripartizioni!P39","v":0},-334098.57238153409,{"$f":"Ripartizioni!$E54*Ripartizioni!Q39","v":218650.89815545426},{"$f":"Ripartizioni!$E54*Ripartizioni!R39","v":10495.243111461803},{"$f":"Ripartizioni!$E54*Ripartizioni!S39","v":8746.0359262181701},{"$f":"Ripartizioni!$E54*Ripartizioni!T39","v":1749.2071852436338},{"$f":"Ripartizioni!$E54*Ripartizioni!U39","v":2186.5089815545425},{"$f":"Ripartizioni!$E54*Ripartizioni!V39","v":0},{"$f":"Ripartizioni!$E54*Ripartizioni!W39","v":0},{"$f":"Ripartizioni!$E54*Ripartizioni!X39","v":0},{"$f":"Ripartizioni!$E54*Ripartizioni!Y39","v":0},241827.89335993241,{"$f":"Ripartizioni!$E54*Ripartizioni!Z39","v":74341.305372854447},null,{"$f":"Ripartizioni!$E54*Ripartizioni!AB39","v":0},{"$f":"Ripartizioni!$E54*Ripartizioni!AC39","v":0},{"$f":"Ripartizioni!$E54*Ripartizioni!AD39","v":0},{"$f":"Ripartizioni!$E54*Ripartizioni!AE39","v":0},{"$f":"Ripartizioni!$E54*Ripartizioni!AF39","v":0},{"$f":"Ripartizioni!$E54*Ripartizioni!AG39","v":0},{"$f":"Ripartizioni!$E54*Ripartizioni!AH39","v":0},null,null,null,null,null,74341.305372854447,null,0,{"$f":"Ripartizioni!$E54*Ripartizioni!AO39","v":874.60359262181692},{"$f":"Ripartizioni!$E54*Ripartizioni!AP39","v":3935.7161667981763},4810.3197594199937,{"$f":"Ripartizioni!$E54*Ripartizioni!AQ39","v":0},{"$f":"Ripartizioni!$E54*Ripartizioni!AR39","v":13119.053889327255},{"$f":"Ripartizioni!$E54*Ripartizioni!AS39","v":0},{"$f":"Ripartizioni!$E54*Ripartizioni!AT39","v":0},{"$f":"Ripartizioni!$E54*Ripartizioni!AU39","v":0},{"$f":"Ripartizioni!$E54*Ripartizioni!AV39","v":0},{"$f":"Ripartizioni!$E54*Ripartizioni!AW39","v":0},{"$f":"Ripartizioni!$E54*Ripartizioni!AX39","v":0},{"$f":"Ripartizioni!$E54*Ripartizioni!AY39","v":0},{"$f":"Ripartizioni!$E54*Ripartizioni!AZ39","v":0},13119.053889327255,{"$f":"Ripartizioni!$E54*Ripartizioni!BA39","v":0},0,null,null,0]
["RIP060","Ripartizione Cucina",{"$f":"Ripartizioni!C40","v":"Numero di pasti"},{"$f":"Ripartizioni!E40","v":77050},{"$f":"Ripartizioni!E55","v":15.462246662059519},{"$f":"Ripartizioni!$E55*Ripartizioni!F40","v":0},{"$f":"Ripartizioni!$E55*Ripartizioni!G40","v":0},{"$f":"Ripartizioni!$E55*Ripartizioni!H40","v":0},{"$f":"Ripartizioni!$E55*Ripartizioni!I40","v":0},{"$f":"Ripartizioni!$E55*Ripartizioni!J40","v":0},{"$f":"Ripartizioni!$E55*Ripartizioni!K40","v":0},{"$f":"Ripartizioni!$E55*Ripartizioni!L40","v":0},{"$f":"Ripartizioni!$E55*Ripartizioni!M40","v":0},{"$f":"-SUM(N46,N48:N55,N57:N58)","v":-1191366.1053116859},{"$f":"Ripartizioni!$E55*Ripartizioni!O40","v":0},{"$f":"Ripartizioni!$E55*Ripartizioni!P40","v":0},-1191366.1053116859,{"$f":"Ripartizioni!$E55*Ripartizioni!Q40","v":997314.90970283898},{"$f":"Ripartizioni!$E55*Ripartizioni!R40","v":0},{"$f":"Ripartizioni!$E55*Ripartizioni!S40","v":0},{"$f":"Ripartizioni!$E55*Ripartizioni!T40","v":0},{"$f":"Ripartizioni!$E55*Ripartizioni!U40","v":0},{"$f":"Ripartizioni!$E55*Ripartizioni!V40","v":0},{"$f":"Ripartizioni!$E55*Ripartizioni!W40","v":0},{"$f":"Ripartizioni!$E55*Ripartizioni!X40","v":0},{"$f":"Ripartizioni!$E55*Ripartizioni!Y40","v":0},997314.90970283898,{"$f":"Ripartizioni!$E55*Ripartizioni!Z40","v":153076.24195438923},null,{"$f":"Ripartizioni!$E55*Ripartizioni!AB40","v":0},{"$f":"Ripartizioni!$E55*Ripartizioni!AC40","v":0},{"$f":"Ripartizioni!$E55*Ripartizioni!AD40","v":0},{"$f":"Ripartizioni!$E55*Ripartizioni!AE40","v":0},{"$f":"Ripartizioni!$E55*Ripartizioni!AF40","v":0},{"$f":"Ripartizioni!$E55*Ripartizioni!AG40","v":0},{"$f":"Ripartizioni!$E55*Ripartizioni!AH40","v":0},null,null,null,null,null,{"$f":"SUM(AB56:AO56)","v":153076.24195438923},null,0,{"$f":"Ripartizioni!$E55*Ripartizioni!AO40","v":0},{"$f":"Ripartizioni!$E55*Ripartizioni!AP40","v":0},0,{"$f":"Ripartizioni!$E55*Ripartizioni!AQ40","v":0},{"$f":"Ripartizioni!$E55*Ripartizioni!AR40","v":17781.583661368448},{"$f":"Ripartizioni!$E55*Ripartizioni!AS40","v":0},{"$f":"Ripartizioni!$E55*Ripartizioni!AT40","v":0},{"$f":"Ripartizioni!$E55*Ripartizioni!AU40","v":0},{"$f":"Ripartizioni!$E55*Ripartizioni!AV40","v":0},{"$f":"Ripartizioni!$E55*Ripartizioni!AW40","v":0},{"$f":"Ripartizioni!$E55*Ripartizioni!AX40","v":0},{"$f":"Ripartizioni!$E55*Ripartizioni!AY40","v":23193.369993089276},{"$f":"Ripartizioni!$E55*Ripartizioni!AZ40","v":0},40974.953654457728,{"$f":"Ripartizioni!$E55*Ripartizioni!BA40","v":0},0,null,null,0]
["RIP090","Ripartizione Magazzino centrale",{"$f":"Ripartizioni!C41","v":"Allocazione diretta"},{"$f":"Ripartizioni!E41","v":0},{"$f":"Ripartizioni!E56","v":0},{"$f":"Ripartizioni!$E56*Ripartizioni!F41","v":0},{"$f":"Ripartizioni!$E56*Ripartizioni!G41","v":0},{"$f":"Ripartizioni!$E56*Ripartizioni!H41","v":0},{"$f":"Ripartizioni!$E56*Ripartizioni!I41","v":0},{"$f":"Ripartizioni!$E56*Ripartizioni!J41","v":0},{"$f":"Ripartizioni!$E56*Ripartizioni!K41","v":0},{"$f":"Ripartizioni!$E56*Ripartizioni!L41","v":0},{"$f":"Ripartizioni!$E56*Ripartizioni!M41","v":0},{"$f":"Ripartizioni!$E56*Ripartizioni!N41","v":0},{"$f":"-SUM(O46,O48:O56,O58)","v":0},{"$f":"Ripartizioni!$E56*Ripartizioni!P41","v":0},0,{"$f":"Ripartizioni!$E56*Ripartizioni!Q41","v":0},{"$f":"Ripartizioni!$E56*Ripartizioni!R41","v":0},{"$f":"Ripartizioni!$E56*Ripartizioni!S41","v":0},{"$f":"Ripartizioni!$E56*Ripartizioni!T41","v":0},{"$f":"Ripartizioni!$E56*Ripartizioni!U41","v":0},{"$f":"Ripartizioni!$E56*Ripartizioni!V41","v":0},{"$f":"Ripartizioni!$E56*Ripartizioni!W41","v":0},{"$f":"Ripartizioni!$E56*Ripartizioni!X41","v":0},{"$f":"Ripartizioni!$E56*Ripartizioni!Y41","v":0},0,{"$f":"Ripartizioni!$E56*Ripartizioni!Z41","v":0},null,{"$f":"Ripartizioni!$E56*Ripartizioni!AB41","v":0},{"$f":"Ripartizioni!$E56*Ripartizioni!AC41","v":0},{"$f":"Ripartizioni!$E56*Ripartizioni!AD41","v":0},{"$f":"Ripartizioni!$E56*Ripartizioni!AE41","v":0},{"$f":"Ripartizioni!$E56*Ripartizioni!AF41","v":0},{"$f":"Ripartizioni!$E56*Ripartizioni!AG41","v":0},{"$f":"Ripartizioni!$E56*Ripartizioni!AH41","v":0},null,null,null,null,null,0,null,0,{"$f":"Ripartizioni!$E56*Ripartizioni!AO41","v":0},{"$f":"Ripartizioni!$E56*Ripartizioni!AP41","v":0},0,{"$f":"Ripartizioni!$E56*Ripartizioni!AQ41","v":0},{"$f":"Ripartizioni!$E56*Ripartizioni!AR41","v":0},{"$f":"Ripartizioni!$E56*Ripartizioni!AS41","v":0},{"$f":"Ripartizioni!$E56*Ripartizioni!AT41","v":0},{"$f":"Ripartizioni!$E56*Ripartizioni!AU41","v":0},{"$f":"Ripartizioni!$E56*Ripartizioni!AV41","v":0},{"$f":"Ripartizioni!$E56*Ripartizioni!AW41","v":0},{"$f":"Ripartizioni!$E56*Ripartizioni!AX41","v":0},{"$f":"Ripartizioni!$E56*Ripartizioni!AY41","v":0},{"$f":"Ripartizioni!$E56*Ripartizioni!AZ41","v":0},0,{"$f":"Ripartizioni!$E56*Ripartizioni!BA41","v":0},0,null,null,0]
["RIP095","Ripartizione Farmacia",{"$f":"Ripartizioni!C42","v":"Allocazione diretta"},{"$f":"Ripartizioni!E42","v":188000},{"$f":"Ripartizioni!E57","v":2.6542553191489363E-2},{"$f":"Ripartizioni!$E57*Ripartizioni!F42","v":0},{"$f":"Ripartizioni!$E57*Ripartizioni!G42","v":0},{"$f":"Ripartizioni!$E57*Ripartizioni!H42","v":0},{"$f":"Ripartizioni!$E57*Ripartizioni!I42","v":0},{"$f":"Ripartizioni!$E57*Ripartizioni!J42","v":0},{"$f":"Ripartizioni!$E57*Ripartizioni!K42","v":0},{"$f":"Ripartizioni!$E57*Ripartizioni!L42","v":0},{"$f":"Ripartizioni!$E57*Ripartizioni!M42","v":0},{"$f":"Ripartizioni!$E57*Ripartizioni!N42","v":0},{"$f":"Ripartizioni!$E57*Ripartizioni!O42","v":0},{"$f":"-SUM(P46,P48:P57)","v":-4990},-4990,{"$f":"Ripartizioni!$E57*Ripartizioni!Q42","v":0},{"$f":"Ripartizioni!$E57*Ripartizioni!R42","v":0},{"$f":"Ripartizioni!$E57*Ripartizioni!S42","v":0},{"$f":"Ripartizioni!$E57*Ripartizioni!T42","v":0},{"$f":"Ripartizioni!$E57*Ripartizioni!U42","v":0},{"$f":"Ripartizioni!$E57*Ripartizioni!V42","v":0},{"$f":"Ripartizioni!$E57*Ripartizioni!W42","v":0},{"$f":"Ripartizioni!$E57*Ripartizioni!X42","v":1592.5531914893618},{"$f":"Ripartizioni!$E57*Ripartizioni!Y42","v":1990.6914893617022},3583.244680851064,{"$f":"Ripartizioni!$E57*Ripartizioni!Z42","v":1406.7553191489362},null,{"$f":"Ripartizioni!$E57*Ripartizioni!AB42","v":0},{"$f":"Ripartizioni!$E57*Ripartizioni!AC42","v":0},{"$f":"Ripartizioni!$E57*Ripartizioni!AD42","v":0},{"$f":"Ripartizioni!$E57*Ripartizioni!AE42","v":0},{"$f":"Ripartizioni!$E57*Ripartizioni!AF42","v":0},{"$f":"Ripartizioni!$E57*Ripartizioni!AG42","v":0},{"$f":"Ripartizioni!$E57*Ripartizioni!AH42","v":0},null,null,null,null,null,1406.7553191489362,null,0,{"$f":"Ripartizioni!$E57*Ripartizioni!AO42","v":0},{"$f":"Ripartizioni!$E57*Ripartizioni!AP42","v":0},0,{"$f":"Ripartizioni!$E57*Ripartizioni!AQ42","v":0},{"$f":"Ripartizioni!$E57*Ripartizioni!AR42","v":0},{"$f":"Ripartizioni!$E57*Ripartizioni!AS42","v":0},{"$f":"Ripartizioni!$E57*Ripartizioni!AT42","v":0},{"$f":"Ripartizioni!$E57*Ripartizioni!AU42","v":0},{"$f":"Ripartizioni!$E57*Ripartizioni!AV42","v":0},{"$f":"Ripartizioni!$E57*Ripartizioni!AW42","v":0},{"$f":"Ripartizioni!$E57*Ripartizioni!AX42","v":0},{"$f":"Ripartizioni!$E57*Ripartizioni!AY42","v":0},{"$f":"Ripartizioni!$E57*Ripartizioni!AZ42","v":0},0,{"$f":"Ripartizioni!$E57*Ripartizioni!BA42","v":0},0,null,null,0]
[null,"Totale dei costi dei CdC generali dopo ripartizioni",null,null,null,{"$f":"-F48","v":108500},{"$f":"-G49","v":128080.18948056115},{"$f":"-H50","v":105799.35605099301},{"$f":"-I51","v":3000},{"$f":"-J52","v":462361.19701148517},{"$f":"-K53","v":94391.056989727338},{"$f":"-L54","v":399347.07633337722},{"$f":"-M55","v":397507.33284661581},{"$f":"-N56","v":1191366.1053116859},{"$f":"-O57","v":0},{"$f":"-P58","v":4990}]
[null,"Costi netti dopo ripartizioni",null,null,null,{"$f":"SUM(F46:F58)","v":0},4.5474735088646412E-12,-1.2732925824820995E-11,0,2.1827872842550278E-11,-9.0949470177292824E-12,2.5465851649641991E-11,0,0,0,0,{"$f":"SUM(Q46:Q58)","v":0},1691052.465543055,314238.75340065843,{"$f":"SUM(T46:T58)","v":3482540.0197316334},18929.762343100007,33079.842006714411,53360.741748476794,26780.370874238397,61592.553191489365,16990.691489361703,5698565.2003287273,2035607.4486766832,null,0,0,0,0,0,0,0,1134567.33,65281.884997838308,{"$f":"SUM(AM46:AM58)","v":0},{"$f":"SUM(AN46:AN58)","v":0},{"$f":"SUM(AO46:AO58)","v":221562.3000432339},{"$f":"SUM(AP46:AP58)","v":3457018.9637177554},200217.77,{"$f":"SUM(AR46:AR58)","v":200217.77},{"$f":"SUM(AS46:AS58)","v":74967.887754307114},{"$f":"SUM(AT46:AT58)","v":61549.789786933616},{"$f":"SUM(AU46:AU58)","v":136517.67754124073},0,28347.118419187154,0,{"$f":"SUM(AY46:AY58)","v":0},{"$f":"SUM(AZ46:AZ58)","v":0},{"$f":"SUM(BA46:BA58)","v":0},{"$f":"SUM(BB46:BB58)","v":-4000},0,8193.3699930892762,0,32540.488412276434,0,0]
["Voci di Ricavo",null,"COFI ","Delimitazioni +/-","COAN "]
[6000,"Rette - Anziani",-2357500,null,{"$f":"C62+D62","v":-2357500},null,null,null,null,null,null,null,null,null,null,null,null,-2100000,null,-87500,null,null,null,null,null,null,{"$f":"SUM(R62:Z62)","v":-2187500},-170000,null,null,null,null,null,null,null,null,null,null,null,null,null,{"$f":"SUM(AB62:AO62)","v":-170000},null,null,null,null,null,null,null,null,null,null,null,null,null,null,null,null,null,null,null,null,{"$f":"IF(ABS(E62-Q62-AA62-AP62-AR62-AU62-BF62-BH62)<0.0001,0,E62-Q62-AA62-AP62-AR62-AU62-BF62-BH62)","v":0}]
[6001,"Partecipazioni delle casse malati",-2070000,null,{"$f":"C63+D63","v":-2070000},null,null,null,null,null,null,null,null,null,null,null,null,null,null,-1550000,-20000,{"$f":"-80000+50000","v":-30000},-5000,0,0,{"$f":"-115000+90000","v":-25000},{"$f":"SUM(R63:Z63)","v":-1630000},-300000,null,null,null,null,null,null,null,null,null,null,null,null,null,{"$f":"SUM(AB63:AO63)","v":-300000},null,{"$f":"SUM(AQ63)","v":0},-90000,-50000,{"$f":"SUM(AS63:AT63)","v":-140000},null,null,null,null,null,null,null,null,null,null,null,null,null,null,null,0]
[6002,"Assegni grandi invalidi - Anziani",-315000,null,-315000,null,null,null,null,null,null,null,null,null,null,null,null,null,null,-315000,null,null,null,null,null,null,-315000,null,null,null,null,null,null,null,null,null,null,null,null,null,null,0,null,null,null,null,null,null,null,null,null,null,null,null,null,null,null,null,null,null,null,null,0]
[6003,"Altri ricavi - Anziani",0,null,0,null,null,null,null,null,null,null,null,null,null,null,null,null,null,null,null,null,null,null,null,0,0,null,null,null,null,null,null,null,null,null,null,null,null,null,null,0,null,0,null,null,0,null,null,null,null,null,null,null,null,null,null,{"$f":"SUM(AV65:BE65)","v":0},null,{"$f":"SUM(BG65)","v":0},null,null,0]
[601,"Altri ricavi - Settore di attività n",0,null,0,null,null,null,null,null,null,null,null,null,null,null,null,null,null,null,null,null,null,null,null,null,null,null,null,null,null,null,null,null,null,null,null,null,null,null,null,null,null,0,null,null,0,null,null,null,null,null,null,null,null,null,null,0,null,0,null,null,0]
[609,"Diminuzioni dei ricavi relativi ai residenti",21000,null,21000,null,null,null,null,null,null,null,null,null,null,null,null,17000,null,null,null,null,null,null,null,null,17000,2000,null,null,null,null,null,null,null,null,null,null,null,null,null,2000,null,0,null,null,0,null,null,null,null,null,null,null,null,2000,null,2000,null,0,null,null,0]
[61,"Ricavi da prestazioni mediche singole",0,null,0,null,null,null,null,null,null,null,null,null,null,null,null,null,null,null,null,null,null,null,null,null,null,null,null,null,null,null,null,null,null,null,null,null,null,null,null,0,null,0,null,null,0,null,null,null,null,null,null,null,null,null,null,null,null,null,null,null,0]
[62,"Ricavi da prestazioni diagnostiche e terapeutiche singole",0,null,0,null,null,null,null,null,null,null,null,null,null,null,null,null,null,null,null,null,null,null,null,null,null,null,null,null,null,null,null,null,null,null,null,null,null,null,null,0,null,0,null,null,0,null,null,null,null,null,null,null,null,null,null,null,null,null,null,null,0]
[69,"Contributi e sussidi",-4659018.9600000009,null,{"$f":"C70+D70","v":-4659018.9600000009},null,null,null,null,null,null,null,null,null,null,null,null,null,null,-1500000,-20000,-30000,-50000,0,-70000,null,{"$f":"SUM(R70:Z70)","v":-1670000},-1567607.45,null,null,null,null,null,null,null,null,-1134567.33,-65281.88,null,null,-221562.3,-2989018.96,null,null,null,null,null,null,null,null,null,null,null,null,null,null,null,null,null,null,null,null,0]
[null,"Totale  Ricavi",{"$f":"SUM(C62:C70)","v":-9380518.9600000009},{"$f":"SUM(D62:D70)","v":0},{"$f":"SUM(E62:E70)","v":-9380518.9600000009},null,null,null,null,null,null,null,null,null,null,null,null,{"$f":"SUM(R62:R70)","v":-2083000},{"$f":"SUM(S62:S70)","v":0},-3452500,-40000,-60000,-55000,0,-70000,-25000,{"$f":"SUM(AA62:AA70)","v":-5785500},{"$f":"SUM(AB62:AB70)","v":-2035607.45},null,{"$f":"SUM(AD62:AD70)","v":0},{"$f":"SUM(AE62:AE70)","v":0},{"$f":"SUM(AF62:AF70)","v":0},{"$f":"SUM(AG62:AG70)","v":0},{"$f":"SUM(AH62:AH70)","v":0},{"$f":"SUM(AI62:AI70)","v":0},{"$f":"SUM(AJ62:AJ70)","v":0},{"$f":"SUM(AK62:AK70)","v":-1134567.33},{"$f":"SUM(AL62:AL70)","v":-65281.88},{"$f":"SUM(AM62:AM70)","v":0},{"$f":"SUM(AN62:AN70)","v":0},{"$f":"SUM(AO62:AO70)","v":-221562.3},{"$f":"SUM(AP62:AP70)","v":-3457018.96},{"$f":"SUM(AQ62:AQ70)","v":0},{"$f":"SUM(AR62:AR70)","v":0},{"$f":"SUM(AS62:AS70)","v":-90000},{"$f":"SUM(AT62:AT70)","v":-50000},{"$f":"SUM(AU62:AU70)","v":-140000},{"$f":"SUM(AV62:AV70)","v":0},{"$f":"SUM(AW62:AW70)","v":0},{"$f":"SUM(AX62:AX70)","v":0},{"$f":"SUM(AY62:AY70)","v":0},{"$f":"SUM(AZ62:AZ70)","v":0},{"$f":"SUM(BA62:BA70)","v":0},{"$f":"SUM(BB62:BB70)","v":0},{"$f":"SUM(BC62:BC70)","v":0},{"$f":"SUM(BD62:BD70)","v":2000},{"$f":"SUM(BE62:BE70)","v":0},{"$f":"SUM(BF62:BF70)","v":2000},{"$f":"SUM(BG62:BG70)","v":0},{"$f":"SUM(BH62:BH70)","v":0},null,null,{"$f":"IF(ABS(BK13-BK25-BK35-BK50-BK52-BK55-BK66-BK68)<0.0001,0,BK13-BK25-BK35-BK50-BK52-BK55-BK66-BK68)","v":0}]
[null,"Risultato di gestione",{"$f":"C71+C46","v":114726.13999999873},null,{"$f":"E71+E46","v":144341.13999999873},null,null,null,null,null,null,null,null,null,null,null,null,{"$f":"R71+R60","v":-391947.53445694502},{"$f":"S71+S60","v":314238.75340065843},30040.019731633365,-21070.237656899993,-26920.157993285589,-1639.2582515232061,26780.370874238397,-8407.4468085106346,-8009.3085106382969,-86934.799671272747,{"$f":"AB71+AB60","v":-1.3233167119324207E-3},null,{"$f":"AD71+AD60","v":0},{"$f":"AE71+AE60","v":0},{"$f":"AF71+AF60","v":0},{"$f":"AG71+AG60","v":0},{"$f":"AH71+AH60","v":0},{"$f":"AI71+AI60","v":0},{"$f":"AJ71+AJ60","v":0},{"$f":"AK71+AK60","v":0},{"$f":"AL71+AL60","v":4.9978383103734814E-3},{"$f":"AM71+AM60","v":0},{"$f":"AN71+AN60","v":0},{"$f":"AO71+AO60","v":4.3233914766460657E-5},{"$f":"AP71+AP60","v":3.7177554331719875E-3},{"$f":"AQ71+AQ60","v":200217.77},{"$f":"AR71+AR60","v":200217.77},{"$f":"AS71+AS60","v":-15032.112245692886},{"$f":"AT71+AT60","v":11549.789786933616},{"$f":"AU71+AU60","v":-3482.3224587592704},{"$f":"AV71+AV60","v":0},{"$f":"AW71+AW60","v":28347.118419187154},{"$f":"AX71+AX60","v":0},{"$f":"AY71+AY60","v":0},{"$f":"AZ71+AZ60","v":0},{"$f":"BA71+BA60","v":0},{"$f":"BB71+BB60","v":-4000},{"$f":"BC71+BC60","v":0},{"$f":"BD71+BD60","v":10193.369993089276},{"$f":"BE71+BE60","v":0},{"$f":"BF71+BF60","v":34540.488412276434},{"$f":"BG71+BG60","v":0},{"$f":"BH71+BH60","v":0},null,null,{"$f":"IF(ABS(BK14-BK26-BK36-BK51-BK53-BK56-BK67-BK69)<0.0001,0,BK14-BK26-BK36-BK51-BK53-BK56-BK67-BK69)","v":0}]
[null,null,null,null,null,null,null,null,null,null,null,null,null,null,null,null,null,null,null,null,null,null,null,null,null,null,null,null,null,null,null,null,null,null,null,null,null,null,null,null,null,null,null,null,null,null,null,null,null,null,null,null,null,null,null,null,null,null,null,null,null,null,"Risultato totale"]
[null,null,null,null,null,null,null,null,null,null,null,null,null,null,null,null,null,null,null,null,null,null,null,null,null,null,null,null,null,null,null,null,null,null,null,null,null,null,null,null,null,null,null,null,null,null,null,null,null,null,null,null,null,null,null,null,null,null,null,null,null,null,{"$f":"AA72+AP72+AR72+AU72+BF72+BH72+BI72","v":144341.13999999984}]
[null,null,null,null,null,null,null,null,null,null,null,null,null,null,null,null,null,null,null,null,null,null,null,null,null,null,null,null,null,null,null,null,null,null,null,null,null,null,null,null,null,null,null,null,null,null,null,null,null,null,null,null,null,null,null,null,null,null,null,null,null,null,"quando < 0 = utile "]
[null,null,null,null,null,null,null,null,null,null,null,null,null,null,null,null,null,null,null,null,null,null,null,null,null,null,null,null,null,null,null,null,null,null,null,null,null,null,null,null,null,null,null,null,null,null,null,null,null,null,null,null,null,null,null,null,null,null,null,null,null,null,"quando > 0 = perdita"]
[]
[null,null,null,null,null,null,null,null,null,null,null,null,null,null,null,null,null,null,null,null,null,null,"NB Le voci di ricavo con sfondo bianco e contorno nero, andrebbero tutte compilate "]
[]
[null,null,null,null,null,null,null,null,null,null,null,null,null,null,null,null,null,null,null,null,null,null,"Le voci con sfondo bianco e contorno leggere possono essere compilate"]
[]
[null,null,null,null,null,null,null,null,null,null,null,null,null,null,null,null,null,null,null,null,null,null,"Le voci con sfondo grigio non possono essere compilate"]

{"sheet":"Contabilità per UFI 1","index":5,"n_rows":59,"n_cols":17,"rows_kept":59,"cut":false,"hidden":false,"merged":[[3,2,3,13],[3,14,3,16],[4,4,4,5],[4,6,4,7],[5,4,5,5],[5,6,5,7]]}
["  Contabilità per unità finali d'imputazione 1 (UACD)"]
[{"$f":"Parametri!$B$7","v":2021},{"$f":"Parametri!$B$3","v":"ESEMPIO - CPA STANDARD CON CAT-STT"}]
[]
[null,null,"Parte standard",null,null,null,null,null,null,null,null,null,null,null,"Parte individualizzata"]
[null,null,"Servizio alberghiero","Animazione","Cura non LAMal",null,"Cura LAMal",null,"Fisioterapia","Ergoterapia","Altre consulenze e terapie","Servizio\nmedico","Medicamenti ES / EMT","Materiale\nEMAp","Stazionario","Ambulatoriale","Altre voci riconosciute"]
[null,null,"NON\na carico della LAMal","NON\na carico della LAMal","NON\na carico della LAMal",null,"A\ncarico della LAMal",null,"A\ncarico della LAMal","A\ncarico della LAMal","A\ncarico della\nLAMal","A\ncarico della LAMal","A\ncarico della LAMal","A\ncarico della LAMal"]
["Voci di costo ",null,200,210,215,null,220,null,230,231,232,240,250,251,26,27,28]
[null,null,"Fr.","Fr.","aliquota","Fr.","aliquota","Fr.","Fr.","Fr.","Fr.","Fr.","Fr.","Fr.","Fr.","Fr.","Fr."]
[{"$f":"'Contabilità per CDC - UACD'!A9","v":3000},{"$f":"'Contabilità per CDC - UACD'!B9","v":"Salari medici"},{"$f":"'Contabilità per CDC - UACD'!R9","v":0},{"$f":"'Contabilità per CDC - UACD'!S9","v":0},{"$f":"IF(AND(G9=0,'Contabilità per CDC - UACD'!T9=0),0,100%-G9)","v":0},{"$f":"'Contabilità per CDC - UACD'!T9*E9","v":0},0,{"$f":"'Contabilità per CDC - UACD'!T9*G9","v":0},{"$f":"'Contabilità per CDC - UACD'!U9","v":0},{"$f":"'Contabilità per CDC - UACD'!V9","v":0},{"$f":"'Contabilità per CDC - UACD'!W9","v":0},{"$f":"'Contabilità per CDC - UACD'!X9","v":20000},{"$f":"'Contabilità per CDC - UACD'!Z9","v":0},{"$f":"'Contabilità per CDC - UACD'!Y9","v":0},{"$f":"SUM('Contabilità per CDC - UACD'!AB9:AF9,'Contabilità per CDC - UACD'!AI9)","v":150000},{"$f":"SUM('Contabilità per CDC - UACD'!AG9:AH9,'Contabilità per CDC - UACD'!AJ9)","v":0},{"$f":"SUM('Contabilità per CDC - UACD'!AK9:AO9)","v":0}]
[{"$f":"'Contabilità per CDC - UACD'!A10","v":3001},{"$f":"'Contabilità per CDC - UACD'!B10","v":"Salari responsabili di struttura"},{"$f":"'Contabilità per CDC - UACD'!R10","v":0},{"$f":"'Contabilità per CDC - UACD'!S10","v":1000},{"$f":"IF(AND(G10=0,'Contabilità per CDC - UACD'!T10=0),0,100%-G10)","v":1.0000000000000009E-2},{"$f":"'Contabilità per CDC - UACD'!T10*E10","v":1000.0000000000009},0.99,{"$f":"'Contabilità per CDC - UACD'!T10*G10","v":99000},{"$f":"'Contabilità per CDC - UACD'!U10","v":0},{"$f":"'Contabilità per CDC - UACD'!V10","v":0},{"$f":"'Contabilità per CDC - UACD'!W10","v":0},{"$f":"'Contabilità per CDC - UACD'!X10","v":0},{"$f":"'Contabilità per CDC - UACD'!Z10","v":0},{"$f":"'Contabilità per CDC - UACD'!Y10","v":0},{"$f":"SUM('Contabilità per CDC - UACD'!AB10:AF10,'Contabilità per CDC - UACD'!AI10)","v":0},{"$f":"SUM('Contabilità per CDC - UACD'!AG10:AH10,'Contabilità per CDC - UACD'!AJ10)","v":0},{"$f":"SUM('Contabilità per CDC - UACD'!AK10:AO10)","v":0}]
[{"$f":"'Contabilità per CDC - UACD'!A11","v":3001.05},{"$f":"'Contabilità per CDC - UACD'!B11","v":"Salari capi reparto"},{"$f":"'Contabilità per CDC - UACD'!R11","v":0},{"$f":"'Contabilità per CDC - UACD'!S11","v":900},{"$f":"IF(AND(G11=0,'Contabilità per CDC - UACD'!T11=0),0,100%-G11)","v":1.0000000000000009E-2},{"$f":"'Contabilità per CDC - UACD'!T11*E11","v":900.0000000000008},0.99,{"$f":"'Contabilità per CDC - UACD'!T11*G11","v":89100},{"$f":"'Contabilità per CDC - UACD'!U11","v":0},{"$f":"'Contabilità per CDC - UACD'!V11","v":0},{"$f":"'Contabilità per CDC - UACD'!W11","v":0},{"$f":"'Contabilità per CDC - UACD'!X11","v":0},{"$f":"'Contabilità per CDC - UACD'!Z11","v":0},{"$f":"'Contabilità per CDC - UACD'!Y11","v":0},{"$f":"SUM('Contabilità per CDC - UACD'!AB11:AF11,'Contabilità per CDC - UACD'!AI11)","v":100000},{"$f":"SUM('Contabilità per CDC - UACD'!AG11:AH11,'Contabilità per CDC - UACD'!AJ11)","v":0},{"$f":"SUM('Contabilità per CDC - UACD'!AK11:AO11)","v":0}]
[{"$f":"'Contabilità per CDC - UACD'!A12","v":3001.1},{"$f":"'Contabilità per CDC - UACD'!B12","v":"Salari infermieri e operatori socio sanitari (OSS)"},{"$f":"'Contabilità per CDC - UACD'!R12","v":0},{"$f":"'Contabilità per CDC - UACD'!S12","v":35000},{"$f":"IF(AND(G12=0,'Contabilità per CDC - UACD'!T12=0),0,100%-G12)","v":1.0000000000000009E-2},{"$f":"'Contabilità per CDC - UACD'!T12*E12","v":11600.000000000011},0.99,{"$f":"'Contabilità per CDC - UACD'!T12*G12","v":1148400},{"$f":"'Contabilità per CDC - UACD'!U12","v":0},{"$f":"'Contabilità per CDC - UACD'!V12","v":0},{"$f":"'Contabilità per CDC - UACD'!W12","v":0},{"$f":"'Contabilità per CDC - UACD'!X12","v":0},{"$f":"'Contabilità per CDC - UACD'!Z12","v":0},{"$f":"'Contabilità per CDC - UACD'!Y12","v":0},{"$f":"SUM('Contabilità per CDC - UACD'!AB12:AF12,'Contabilità per CDC - UACD'!AI12)","v":425000},{"$f":"SUM('Contabilità per CDC - UACD'!AG12:AH12,'Contabilità per CDC - UACD'!AJ12)","v":0},{"$f":"SUM('Contabilità per CDC - UACD'!AK12:AO12)","v":18000}]
[{"$f":"'Contabilità per CDC - UACD'!A13","v":3001.2},{"$f":"'Contabilità per CDC - UACD'!B13","v":"Salari assistenti e ausiliari di cura"},{"$f":"'Contabilità per CDC - UACD'!R13","v":0},{"$f":"'Contabilità per CDC - UACD'!S13","v":55000},{"$f":"IF(AND(G13=0,'Contabilità per CDC - UACD'!T13=0),0,100%-G13)","v":1.0000000000000009E-2},{"$f":"'Contabilità per CDC - UACD'!T13*E13","v":11500.000000000011},0.99,{"$f":"'Contabilità per CDC - UACD'!T13*G13","v":1138500},{"$f":"'Contabilità per CDC - UACD'!U13","v":0},{"$f":"'Contabilità per CDC - UACD'!V13","v":0},{"$f":"'Contabilità per CDC - UACD'!W13","v":0},{"$f":"'Contabilità per CDC - UACD'!X13","v":0},{"$f":"'Contabilità per CDC - UACD'!Z13","v":0},{"$f":"'Contabilità per CDC - UACD'!Y13","v":0},{"$f":"SUM('Contabilità per CDC - UACD'!AB13:AF13,'Contabilità per CDC - UACD'!AI13)","v":430000},{"$f":"SUM('Contabilità per CDC - UACD'!AG13:AH13,'Contabilità per CDC - UACD'!AJ13)","v":0},{"$f":"SUM('Contabilità per CDC - UACD'!AK13:AO13)","v":40000}]
[3001.3,"Salari dietisti",{"$f":"'Contabilità per CDC - UACD'!R14","v":0},{"$f":"'Contabilità per CDC - UACD'!S14","v":0},{"$f":"IF(AND(G14=0,'Contabilità per CDC - UACD'!T14=0),0,100%-G14)","v":1.0000000000000009E-2},{"$f":"'Contabilità per CDC - UACD'!T14*E14","v":0},0.99,{"$f":"'Contabilità per CDC - UACD'!T14*G14","v":0},{"$f":"'Contabilità per CDC - UACD'!U14","v":0},{"$f":"'Contabilità per CDC - UACD'!V14","v":0},{"$f":"'Contabilità per CDC - UACD'!W14","v":40000},{"$f":"'Contabilità per CDC - UACD'!X14","v":0},{"$f":"'Contabilità per CDC - UACD'!Z14","v":0},{"$f":"'Contabilità per CDC - UACD'!Y14","v":0},{"$f":"SUM('Contabilità per CDC - UACD'!AB14:AF14,'Contabilità per CDC - UACD'!AI14)","v":0},{"$f":"SUM('Contabilità per CDC - UACD'!AG14:AH14,'Contabilità per CDC - UACD'!AJ14)","v":0},{"$f":"SUM('Contabilità per CDC - UACD'!AK14:AO14)","v":0}]
[{"$f":"'Contabilità per CDC - UACD'!A15","v":3001.9},{"$f":"'Contabilità per CDC - UACD'!B15","v":"Salari personale di cura in formazione e stagisti"},{"$f":"'Contabilità per CDC - UACD'!R15","v":0},{"$f":"'Contabilità per CDC - UACD'!S15","v":0},{"$f":"IF(AND(G15=0,'Contabilità per CDC - UACD'!T15=0),0,100%-G15)","v":0.99},{"$f":"'Contabilità per CDC - UACD'!T15*E15","v":0},0.01,{"$f":"'Contabilità per CDC - UACD'!T15*G15","v":0},{"$f":"'Contabilità per CDC - UACD'!U15","v":0},{"$f":"'Contabilità per CDC - UACD'!V15","v":0},{"$f":"'Contabilità per CDC - UACD'!W15","v":0},{"$f":"'Contabilità per CDC - UACD'!X15","v":0},{"$f":"'Contabilità per CDC - UACD'!Z15","v":0},{"$f":"'Contabilità per CDC - UACD'!Y15","v":0},{"$f":"SUM('Contabilità per CDC - UACD'!AB15:AF15,'Contabilità per CDC - UACD'!AI15)","v":0},{"$f":"SUM('Contabilità per CDC - UACD'!AG15:AH15,'Contabilità per CDC - UACD'!AJ15)","v":0},{"$f":"SUM('Contabilità per CDC - UACD'!AK15:AO15)","v":35500}]
[{"$f":"'Contabilità per CDC - UACD'!A16","v":3002},{"$f":"'Contabilità per CDC - UACD'!B16","v":"Salari personale altre discipline mediche specializzate"},{"$f":"'Contabilità per CDC - UACD'!R16","v":0},{"$f":"'Contabilità per CDC - UACD'!S16","v":125000},{"$f":"IF(AND(G16=0,'Contabilità per CDC - UACD'!T16=0),0,100%-G16)","v":0},{"$f":"'Contabilità per CDC - UACD'!T16*E16","v":0},0,{"$f":"'Contabilità per CDC - UACD'!T16*G16","v":0},{"$f":"'Contabilità per CDC - UACD'!U16","v":10000},{"$f":"'Contabilità per CDC - UACD'!V16","v":20000},{"$f":"'Contabilità per CDC - UACD'!W16","v":0},{"$f":"'Contabilità per CDC - UACD'!X16","v":0},{"$f":"'Contabilità per CDC - UACD'!Z16","v":0},{"$f":"'Contabilità per CDC - UACD'!Y16","v":0},{"$f":"SUM('Contabilità per CDC - UACD'!AB16:AF16,'Contabilità per CDC - UACD'!AI16)","v":120000},{"$f":"SUM('Contabilità per CDC - UACD'!AG16:AH16,'Contabilità per CDC - UACD'!AJ16)","v":0},{"$f":"SUM('Contabilità per CDC - UACD'!AK16:AO16)","v":500}]
[{"$f":"'Contabilità per CDC - UACD'!A17","v":3003},{"$f":"'Contabilità per CDC - UACD'!B17","v":"Salari personale amministrativo"},{"$f":"'Contabilità per CDC - UACD'!R17","v":0},{"$f":"'Contabilità per CDC - UACD'!S17","v":0},{"$f":"IF(AND(G17=0,'Contabilità per CDC - UACD'!T17=0),0,100%-G17)","v":0},{"$f":"'Contabilità per CDC - UACD'!T17*E17","v":0},0,{"$f":"'Contabilità per CDC - UACD'!T17*G17","v":0},{"$f":"'Contabilità per CDC - UACD'!U17","v":0},{"$f":"'Contabilità per CDC - UACD'!V17","v":0},{"$f":"'Contabilità per CDC - UACD'!W17","v":0},{"$f":"'Contabilità per CDC - UACD'!X17","v":0},{"$f":"'Contabilità per CDC - UACD'!Z17","v":0},{"$f":"'Contabilità per CDC - UACD'!Y17","v":0},{"$f":"SUM('Contabilità per CDC - UACD'!AB17:AF17,'Contabilità per CDC - UACD'!AI17)","v":0},{"$f":"SUM('Contabilità per CDC - UACD'!AG17:AH17,'Contabilità per CDC - UACD'!AJ17)","v":0},{"$f":"SUM('Contabilità per CDC - UACD'!AK17:AO17)","v":23500}]
[{"$f":"'Contabilità per CDC - UACD'!A18","v":3004},{"$f":"'Contabilità per CDC - UACD'!B18","v":"Salari personale servizio alberghiero"},{"$f":"'Contabilità per CDC - UACD'!R18","v":0},{"$f":"'Contabilità per CDC - UACD'!S18","v":0},{"$f":"IF(AND(G18=0,'Contabilità per CDC - UACD'!T18=0),0,100%-G18)","v":0},{"$f":"'Contabilità per CDC - UACD'!T18*E18","v":0},0,{"$f":"'Contabilità per CDC - UACD'!T18*G18","v":0},{"$f":"'Contabilità per CDC - UACD'!U18","v":0},{"$f":"'Contabilità per CDC - UACD'!V18","v":0},{"$f":"'Contabilità per CDC - UACD'!W18","v":0},{"$f":"'Contabilità per CDC - UACD'!X18","v":0},{"$f":"'Contabilità per CDC - UACD'!Z18","v":0},{"$f":"'Contabilità per CDC - UACD'!Y18","v":0},{"$f":"SUM('Contabilità per CDC - UACD'!AB18:AF18,'Contabilità per CDC - UACD'!AI18)","v":0},{"$f":"SUM('Contabilità per CDC - UACD'!AG18:AH18,'Contabilità per CDC - UACD'!AJ18)","v":0},{"$f":"SUM('Contabilità per CDC - UACD'!AK18:AO18)","v":25000}]
[{"$f":"'Contabilità per CDC - UACD'!A19","v":3005},{"$f":"'Contabilità per CDC - UACD'!B19","v":"Salari personale servizio tecnico"},{"$f":"'Contabilità per CDC - UACD'!R19","v":0},{"$f":"'Contabilità per CDC - UACD'!S19","v":0},{"$f":"IF(AND(G19=0,'Contabilità per CDC - UACD'!T19=0),0,100%-G19)","v":0},{"$f":"'Contabilità per CDC - UACD'!T19*E19","v":0},0,{"$f":"'Contabilità per CDC - UACD'!T19*G19","v":0},{"$f":"'Contabilità per CDC - UACD'!U19","v":0},{"$f":"'Contabilità per CDC - UACD'!V19","v":0},{"$f":"'Contabilità per CDC - UACD'!W19","v":0},{"$f":"'Contabilità per CDC - UACD'!X19","v":0},{"$f":"'Contabilità per CDC - UACD'!Z19","v":0},{"$f":"'Contabilità per CDC - UACD'!Y19","v":0},{"$f":"SUM('Contabilità per CDC - UACD'!AB19:AF19,'Contabilità per CDC - UACD'!AI19)","v":0},{"$f":"SUM('Contabilità per CDC - UACD'!AG19:AH19,'Contabilità per CDC - UACD'!AJ19)","v":0},{"$f":"SUM('Contabilità per CDC - UACD'!AK19:AO19)","v":7000}]
[{"$f":"'Contabilità per CDC - UACD'!A20","v":3009},{"$f":"'Contabilità per CDC - UACD'!B20","v":"Prestazioni continuative da parte di personale esterno"},{"$f":"'Contabilità per CDC - UACD'!R20","v":0},{"$f":"'Contabilità per CDC - UACD'!S20","v":0},{"$f":"IF(AND(G20=0,'Contabilità per CDC - UACD'!T20=0),0,100%-G20)","v":1.0000000000000009E-2},{"$f":"'Contabilità per CDC - UACD'!T20*E20","v":500.00000000000045},0.99,{"$f":"'Contabilità per CDC - UACD'!T20*G20","v":49500},{"$f":"'Contabilità per CDC - UACD'!U20","v":0},{"$f":"'Contabilità per CDC - UACD'!V20","v":0},{"$f":"'Contabilità per CDC - UACD'!W20","v":0},{"$f":"'Contabilità per CDC - UACD'!X20","v":0},{"$f":"'Contabilità per CDC - UACD'!Z20","v":0},{"$f":"'Contabilità per CDC - UACD'!Y20","v":0},{"$f":"SUM('Contabilità per CDC - UACD'!AB20:AF20,'Contabilità per CDC - UACD'!AI20)","v":0},{"$f":"SUM('Contabilità per CDC - UACD'!AG20:AH20,'Contabilità per CDC - UACD'!AJ20)","v":0},{"$f":"SUM('Contabilità per CDC - UACD'!AK20:AO20)","v":0}]
[{"$f":"'Contabilità per CDC - UACD'!A21","v":309},{"$f":"'Contabilità per CDC - UACD'!B21","v":"Messa a disposizione di personale a terzi"},{"$f":"'Contabilità per CDC - UACD'!R21","v":0},{"$f":"'Contabilità per CDC - UACD'!S21","v":0},{"$f":"IF(AND(G21=0,'Contabilità per CDC - UACD'!T21=0),0,100%-G21)","v":1.0000000000000009E-2},{"$f":"'Contabilità per CDC - UACD'!T21*E21","v":0},0.99,{"$f":"'Contabilità per CDC - UACD'!T21*G21","v":0},{"$f":"'Contabilità per CDC - UACD'!U21","v":0},{"$f":"'Contabilità per CDC - UACD'!V21","v":0},{"$f":"'Contabilità per CDC - UACD'!W21","v":0},{"$f":"'Contabilità per CDC - UACD'!X21","v":0},{"$f":"'Contabilità per CDC - UACD'!Z21","v":0},{"$f":"'Contabilità per CDC - UACD'!Y21","v":0},{"$f":"SUM('Contabilità per CDC - UACD'!AB21:AF21,'Contabilità per CDC - UACD'!AI21)","v":0},{"$f":"SUM('Contabilità per CDC - UACD'!AG21:AH21,'Contabilità per CDC - UACD'!AJ21)","v":0},{"$f":"SUM('Contabilità per CDC - UACD'!AK21:AO21)","v":0}]
[{"$f":"'Contabilità per CDC - UACD'!A22","v":37},{"$f":"'Contabilità per CDC - UACD'!B22","v":"Oneri sociali"},{"$f":"'Contabilità per CDC - UACD'!R22","v":0},{"$f":"'Contabilità per CDC - UACD'!S22","v":50263.035019455252},{"$f":"IF(AND(G22=0,'Contabilità per CDC - UACD'!T22=0),0,100%-G22)","v":1.0000000000000009E-2},{"$f":"'Contabilità per CDC - UACD'!T22*E22","v":5793.3419801124128},0.99,{"$f":"'Contabilità per CDC - UACD'!T22*G22","v":573540.85603112844},{"$f":"'Contabilità per CDC - UACD'!U22","v":2317.3367920449632},{"$f":"'Contabilità per CDC - UACD'!V22","v":4634.6735840899264},{"$f":"'Contabilità per CDC - UACD'!W22","v":9269.3471681798528},{"$f":"'Contabilità per CDC - UACD'!X22","v":4634.6735840899264},{"$f":"'Contabilità per CDC - UACD'!Z22","v":0},{"$f":"'Contabilità per CDC - UACD'!Y22","v":0},{"$f":"SUM('Contabilità per CDC - UACD'!AB22:AF22,'Contabilità per CDC - UACD'!AI22)","v":283873.75702550798},{"$f":"SUM('Contabilità per CDC - UACD'!AG22:AH22,'Contabilità per CDC - UACD'!AJ22)","v":0},{"$f":"SUM('Contabilità per CDC - UACD'!AK22:AO22)","v":34644.185041072204}]
[null,{"$f":"'Contabilità per CDC - UACD'!B23","v":"Neutralizzazione cassa pensione"},{"$f":"'Contabilità per CDC - UACD'!R23","v":0},{"$f":"'Contabilità per CDC - UACD'!S23","v":0},{"$f":"IF(AND(G23=0,'Contabilità per CDC - UACD'!T23=0),0,100%-G23)","v":0},{"$f":"'Contabilità per CDC - UACD'!T23*E23","v":0},0,{"$f":"'Contabilità per CDC - UACD'!T23*G23","v":0},{"$f":"'Contabilità per CDC - UACD'!U23","v":0},{"$f":"'Contabilità per CDC - UACD'!V23","v":0},{"$f":"'Contabilità per CDC - UACD'!W23","v":0},{"$f":"'Contabilità per CDC - UACD'!X23","v":0},{"$f":"'Contabilità per CDC - UACD'!Z23","v":0},{"$f":"'Contabilità per CDC - UACD'!Y23","v":0},{"$f":"SUM('Contabilità per CDC - UACD'!AB23:AF23,'Contabilità per CDC - UACD'!AI23)","v":0},{"$f":"SUM('Contabilità per CDC - UACD'!AG23:AH23,'Contabilità per CDC - UACD'!AJ23)","v":0},{"$f":"SUM('Contabilità per CDC - UACD'!AK23:AO23)","v":0}]
[{"$f":"'Contabilità per CDC - UACD'!A24","v":38},{"$f":"'Contabilità per CDC - UACD'!B24","v":"Onorari medici"},{"$f":"'Contabilità per CDC - UACD'!R24","v":0},{"$f":"'Contabilità per CDC - UACD'!S24","v":0},{"$f":"IF(AND(G24=0,'Contabilità per CDC - UACD'!T24=0),0,100%-G24)","v":1},{"$f":"'Contabilità per CDC - UACD'!T24*E24","v":10000},0,{"$f":"'Contabilità per CDC - UACD'!T24*G24","v":0},{"$f":"'Contabilità per CDC - UACD'!U24","v":0},{"$f":"'Contabilità per CDC - UACD'!V24","v":0},{"$f":"'Contabilità per CDC - UACD'!W24","v":0},{"$f":"'Contabilità per CDC - UACD'!X24","v":0},{"$f":"'Contabilità per CDC - UACD'!Z24","v":0},{"$f":"'Contabilità per CDC - UACD'!Y24","v":0},{"$f":"SUM('Contabilità per CDC - UACD'!AB24:AF24,'Contabilità per CDC - UACD'!AI24)","v":0},{"$f":"SUM('Contabilità per CDC - UACD'!AG24:AH24,'Contabilità per CDC - UACD'!AJ24)","v":0},{"$f":"SUM('Contabilità per CDC - UACD'!AK24:AO24)","v":15000}]
[{"$f":"'Contabilità per CDC - UACD'!A25","v":39},{"$f":"'Contabilità per CDC - UACD'!B25","v":"Altri costi del personale"},{"$f":"'Contabilità per CDC - UACD'!R25","v":0},{"$f":"'Contabilità per CDC - UACD'!S25","v":500},{"$f":"IF(AND(G25=0,'Contabilità per CDC - UACD'!T25=0),0,100%-G25)","v":1},{"$f":"'Contabilità per CDC - UACD'!T25*E25","v":15000},0,{"$f":"'Contabilità per CDC - UACD'!T25*G25","v":0},{"$f":"'Contabilità per CDC - UACD'!U25","v":500},{"$f":"'Contabilità per CDC - UACD'!V25","v":500},{"$f":"'Contabilità per CDC - UACD'!W25","v":0},{"$f":"'Contabilità per CDC - UACD'!X25","v":0},{"$f":"'Contabilità per CDC - UACD'!Z25","v":0},{"$f":"'Contabilità per CDC - UACD'!Y25","v":0},{"$f":"SUM('Contabilità per CDC - UACD'!AB25:AF25,'Contabilità per CDC - UACD'!AI25)","v":0},{"$f":"SUM('Contabilità per CDC - UACD'!AG25:AH25,'Contabilità per CDC - UACD'!AJ25)","v":0},{"$f":"SUM('Contabilità per CDC - UACD'!AK25:AO25)","v":20000}]
[{"$f":"'Contabilità per CDC - UACD'!A26","v":40},{"$f":"'Contabilità per CDC - UACD'!B26","v":"Fabbisogno medico"},{"$f":"'Contabilità per CDC - UACD'!R26","v":0},{"$f":"'Contabilità per CDC - UACD'!S26","v":0},{"$f":"IF(AND(G26=0,'Contabilità per CDC - UACD'!T26=0),0,100%-G26)","v":0},{"$f":"'Contabilità per CDC - UACD'!T26*E26","v":0},0,{"$f":"'Contabilità per CDC - UACD'!T26*G26","v":0},{"$f":"'Contabilità per CDC - UACD'!U26","v":0},{"$f":"'Contabilità per CDC - UACD'!V26","v":0},{"$f":"'Contabilità per CDC - UACD'!W26","v":0},{"$f":"'Contabilità per CDC - UACD'!X26","v":100},{"$f":"'Contabilità per CDC - UACD'!Z26","v":15000},{"$f":"'Contabilità per CDC - UACD'!Y26","v":60000},{"$f":"SUM('Contabilità per CDC - UACD'!AB26:AF26,'Contabilità per CDC - UACD'!AI26)","v":25000},{"$f":"SUM('Contabilità per CDC - UACD'!AG26:AH26,'Contabilità per CDC - UACD'!AJ26)","v":0},{"$f":"SUM('Contabilità per CDC - UACD'!AK26:AO26)","v":5000}]
[{"$f":"'Contabilità per CDC - UACD'!A27","v":41},{"$f":"'Contabilità per CDC - UACD'!B27","v":"Costi dei generi alimentari"},{"$f":"'Contabilità per CDC - UACD'!R27","v":0},{"$f":"'Contabilità per CDC - UACD'!S27","v":0},{"$f":"IF(AND(G27=0,'Contabilità per CDC - UACD'!T27=0),0,100%-G27)","v":0},{"$f":"'Contabilità per CDC - UACD'!T27*E27","v":0},0,{"$f":"'Contabilità per CDC - UACD'!T27*G27","v":0},{"$f":"'Contabilità per CDC - UACD'!U27","v":0},{"$f":"'Contabilità per CDC - UACD'!V27","v":0},{"$f":"'Contabilità per CDC - UACD'!W27","v":0},{"$f":"'Contabilità per CDC - UACD'!X27","v":0},{"$f":"'Contabilità per CDC - UACD'!Z27","v":0},{"$f":"'Contabilità per CDC - UACD'!Y27","v":0},{"$f":"SUM('Contabilità per CDC - UACD'!AB27:AF27,'Contabilità per CDC - UACD'!AI27)","v":0},{"$f":"SUM('Contabilità per CDC - UACD'!AG27:AH27,'Contabilità per CDC - UACD'!AJ27)","v":0},{"$f":"SUM('Contabilità per CDC - UACD'!AK27:AO27)","v":0}]
[{"$f":"'Contabilità per CDC - UACD'!A28","v":42},{"$f":"'Contabilità per CDC - UACD'!B28","v":"Costi di economia domestica"},{"$f":"'Contabilità per CDC - UACD'!R28","v":25000},{"$f":"'Contabilità per CDC - UACD'!S28","v":500},{"$f":"IF(AND(G28=0,'Contabilità per CDC - UACD'!T28=0),0,100%-G28)","v":1},{"$f":"'Contabilità per CDC - UACD'!T28*E28","v":3000},0,{"$f":"'Contabilità per CDC - UACD'!T28*G28","v":0},{"$f":"'Contabilità per CDC - UACD'!U28","v":250},{"$f":"'Contabilità per CDC - UACD'!V28","v":250},{"$f":"'Contabilità per CDC - UACD'!W28","v":0},{"$f":"'Contabilità per CDC - UACD'!X28","v":0},{"$f":"'Contabilità per CDC - UACD'!Z28","v":0},{"$f":"'Contabilità per CDC - UACD'!Y28","v":0},{"$f":"SUM('Contabilità per CDC - UACD'!AB28:AF28,'Contabilità per CDC - UACD'!AI28)","v":1000},{"$f":"SUM('Contabilità per CDC - UACD'!AG28:AH28,'Contabilità per CDC - UACD'!AJ28)","v":0},{"$f":"SUM('Contabilità per CDC - UACD'!AK28:AO28)","v":20000}]
[{"$f":"'Contabilità per CDC - UACD'!A29","v":43},{"$f":"'Contabilità per CDC - UACD'!B29","v":"Manutenzione e riparazione"},{"$f":"'Contabilità per CDC - UACD'!R29","v":2000},{"$f":"'Contabilità per CDC - UACD'!S29","v":100},{"$f":"IF(AND(G29=0,'Contabilità per CDC - UACD'!T29=0),0,100%-G29)","v":1},{"$f":"'Contabilità per CDC - UACD'!T29*E29","v":8000},0,{"$f":"'Contabilità per CDC - UACD'!T29*G29","v":0},{"$f":"'Contabilità per CDC - UACD'!U29","v":150},{"$f":"'Contabilità per CDC - UACD'!V29","v":150},{"$f":"'Contabilità per CDC - UACD'!W29","v":0},{"$f":"'Contabilità per CDC - UACD'!X29","v":0},{"$f":"'Contabilità per CDC - UACD'!Z29","v":0},{"$f":"'Contabilità per CDC - UACD'!Y29","v":0},{"$f":"SUM('Contabilità per CDC - UACD'!AB29:AF29,'Contabilità per CDC - UACD'!AI29)","v":0},{"$f":"SUM('Contabilità per CDC - UACD'!AG29:AH29,'Contabilità per CDC - UACD'!AJ29)","v":0},{"$f":"SUM('Contabilità per CDC - UACD'!AK29:AO29)","v":11000}]
[{"$f":"'Contabilità per CDC - UACD'!A30","v":440},{"$f":"'Contabilità per CDC - UACD'!B30","v":"Investimenti inferiori al limite di attivazione COAN"},{"$f":"'Contabilità per CDC - UACD'!R30","v":5000},{"$f":"'Contabilità per CDC - UACD'!S30","v":100},{"$f":"IF(AND(G30=0,'Contabilità per CDC - UACD'!T30=0),0,100%-G30)","v":1},{"$f":"'Contabilità per CDC - UACD'!T30*E30","v":9500},0,{"$f":"'Contabilità per CDC - UACD'!T30*G30","v":0},{"$f":"'Contabilità per CDC - UACD'!U30","v":500},{"$f":"'Contabilità per CDC - UACD'!V30","v":500},{"$f":"'Contabilità per CDC - UACD'!W30","v":0},{"$f":"'Contabilità per CDC - UACD'!X30","v":0},{"$f":"'Contabilità per CDC - UACD'!Z30","v":0},{"$f":"'Contabilità per CDC - UACD'!Y30","v":0},{"$f":"SUM('Contabilità per CDC - UACD'!AB30:AF30,'Contabilità per CDC - UACD'!AI30)","v":0},{"$f":"SUM('Contabilità per CDC - UACD'!AG30:AH30,'Contabilità per CDC - UACD'!AJ30)","v":0},{"$f":"SUM('Contabilità per CDC - UACD'!AK30:AO30)","v":15000}]
[{"$f":"'Contabilità per CDC - UACD'!A31","v":442},{"$f":"'Contabilità per CDC - UACD'!B31","v":"Ammortamenti"},{"$f":"'Contabilità per CDC - UACD'!R31","v":0},{"$f":"'Contabilità per CDC - UACD'!S31","v":0},{"$f":"IF(AND(G31=0,'Contabilità per CDC - UACD'!T31=0),0,100%-G31)","v":0},{"$f":"'Contabilità per CDC - UACD'!T31*E31","v":0},0,{"$f":"'Contabilità per CDC - UACD'!T31*G31","v":0},{"$f":"'Contabilità per CDC - UACD'!U31","v":0},{"$f":"'Contabilità per CDC - UACD'!V31","v":0},{"$f":"'Contabilità per CDC - UACD'!W31","v":0},{"$f":"'Contabilità per CDC - UACD'!X31","v":0},{"$f":"'Contabilità per CDC - UACD'!Z31","v":0},{"$f":"'Contabilità per CDC - UACD'!Y31","v":0},{"$f":"SUM('Contabilità per CDC - UACD'!AB31:AF31,'Contabilità per CDC - UACD'!AI31)","v":0},{"$f":"SUM('Contabilità per CDC - UACD'!AG31:AH31,'Contabilità per CDC - UACD'!AJ31)","v":0},{"$f":"SUM('Contabilità per CDC - UACD'!AK31:AO31)","v":642534.70000000007}]
[{"$f":"'Contabilità per CDC - UACD'!A32","v":443},{"$f":"'Contabilità per CDC - UACD'!B32","v":"Canoni di locaz. per immobilizzaz. <  limite di attivazione COAN"},{"$f":"'Contabilità per CDC - UACD'!R32","v":0},{"$f":"'Contabilità per CDC - UACD'!S32","v":0},{"$f":"IF(AND(G32=0,'Contabilità per CDC - UACD'!T32=0),0,100%-G32)","v":0},{"$f":"'Contabilità per CDC - UACD'!T32*E32","v":0},0,{"$f":"'Contabilità per CDC - UACD'!T32*G32","v":0},{"$f":"'Contabilità per CDC - UACD'!U32","v":0},{"$f":"'Contabilità per CDC - UACD'!V32","v":0},{"$f":"'Contabilità per CDC - UACD'!W32","v":0},{"$f":"'Contabilità per CDC - UACD'!X32","v":0},{"$f":"'Contabilità per CDC - UACD'!Z32","v":0},{"$f":"'Contabilità per CDC - UACD'!Y32","v":0},{"$f":"SUM('Contabilità per CDC - UACD'!AB32:AF32,'Contabilità per CDC - UACD'!AI32)","v":0},{"$f":"SUM('Contabilità per CDC - UACD'!AG32:AH32,'Contabilità per CDC - UACD'!AJ32)","v":0},{"$f":"SUM('Contabilità per CDC - UACD'!AK32:AO32)","v":0}]
[{"$f":"'Contabilità per CDC - UACD'!A33","v":444},{"$f":"'Contabilità per CDC - UACD'!B33","v":"Canoni di locaz. per immobilizzaz. >= limite di attivazione COAN"},{"$f":"'Contabilità per CDC - UACD'!R33","v":0},{"$f":"'Contabilità per CDC - UACD'!S33","v":0},{"$f":"IF(AND(G33=0,'Contabilità per CDC - UACD'!T33=0),0,100%-G33)","v":0},{"$f":"'Contabilità per CDC - UACD'!T33*E33","v":0},0,{"$f":"'Contabilità per CDC - UACD'!T33*G33","v":0},{"$f":"'Contabilità per CDC - UACD'!U33","v":0},{"$f":"'Contabilità per CDC - UACD'!V33","v":0},{"$f":"'Contabilità per CDC - UACD'!W33","v":0},{"$f":"'Contabilità per CDC - UACD'!X33","v":0},{"$f":"'Contabilità per CDC - UACD'!Z33","v":0},{"$f":"'Contabilità per CDC - UACD'!Y33","v":0},{"$f":"SUM('Contabilità per CDC - UACD'!AB33:AF33,'Contabilità per CDC - UACD'!AI33)","v":0},{"$f":"SUM('Contabilità per CDC - UACD'!AG33:AH33,'Contabilità per CDC - UACD'!AJ33)","v":0},{"$f":"SUM('Contabilità per CDC - UACD'!AK33:AO33)","v":0}]
[{"$f":"'Contabilità per CDC - UACD'!A34","v":448},{"$f":"'Contabilità per CDC - UACD'!B34","v":"Interessi calcolatori sull'attivo fisso"},{"$f":"'Contabilità per CDC - UACD'!R34","v":0},{"$f":"'Contabilità per CDC - UACD'!S34","v":0},{"$f":"IF(AND(G34=0,'Contabilità per CDC - UACD'!T34=0),0,100%-G34)","v":0},{"$f":"'Contabilità per CDC - UACD'!T34*E34","v":0},0,{"$f":"'Contabilità per CDC - UACD'!T34*G34","v":0},{"$f":"'Contabilità per CDC - UACD'!U34","v":0},{"$f":"'Contabilità per CDC - UACD'!V34","v":0},{"$f":"'Contabilità per CDC - UACD'!W34","v":0},{"$f":"'Contabilità per CDC - UACD'!X34","v":0},{"$f":"'Contabilità per CDC - UACD'!Z34","v":0},{"$f":"'Contabilità per CDC - UACD'!Y34","v":0},{"$f":"SUM('Contabilità per CDC - UACD'!AB34:AF34,'Contabilità per CDC - UACD'!AI34)","v":0},{"$f":"SUM('Contabilità per CDC - UACD'!AG34:AH34,'Contabilità per CDC - UACD'!AJ34)","v":0},{"$f":"SUM('Contabilità per CDC - UACD'!AK34:AO34)","v":492032.63000000006}]
[{"$f":"'Contabilità per CDC - UACD'!A35","v":45},{"$f":"'Contabilità per CDC - UACD'!B35","v":"Costi per energia e acqua"},{"$f":"'Contabilità per CDC - UACD'!R35","v":0},{"$f":"'Contabilità per CDC - UACD'!S35","v":0},{"$f":"IF(AND(G35=0,'Contabilità per CDC - UACD'!T35=0),0,100%-G35)","v":0},{"$f":"'Contabilità per CDC - UACD'!T35*E35","v":0},0,{"$f":"'Contabilità per CDC - UACD'!T35*G35","v":0},{"$f":"'Contabilità per CDC - UACD'!U35","v":0},{"$f":"'Contabilità per CDC - UACD'!V35","v":0},{"$f":"'Contabilità per CDC - UACD'!W35","v":0},{"$f":"'Contabilità per CDC - UACD'!X35","v":0},{"$f":"'Contabilità per CDC - UACD'!Z35","v":0},{"$f":"'Contabilità per CDC - UACD'!Y35","v":0},{"$f":"SUM('Contabilità per CDC - UACD'!AB35:AF35,'Contabilità per CDC - UACD'!AI35)","v":0},{"$f":"SUM('Contabilità per CDC - UACD'!AG35:AH35,'Contabilità per CDC - UACD'!AJ35)","v":0},{"$f":"SUM('Contabilità per CDC - UACD'!AK35:AO35)","v":0}]
[{"$f":"'Contabilità per CDC - UACD'!A36","v":46},{"$f":"'Contabilità per CDC - UACD'!B36","v":"Oneri finanziari"},{"$f":"'Contabilità per CDC - UACD'!R36","v":0},{"$f":"'Contabilità per CDC - UACD'!S36","v":0},{"$f":"IF(AND(G36=0,'Contabilità per CDC - UACD'!T36=0),0,100%-G36)","v":0},{"$f":"'Contabilità per CDC - UACD'!T36*E36","v":0},0,{"$f":"'Contabilità per CDC - UACD'!T36*G36","v":0},{"$f":"'Contabilità per CDC - UACD'!U36","v":0},{"$f":"'Contabilità per CDC - UACD'!V36","v":0},{"$f":"'Contabilità per CDC - UACD'!W36","v":0},{"$f":"'Contabilità per CDC - UACD'!X36","v":0},{"$f":"'Contabilità per CDC - UACD'!Z36","v":0},{"$f":"'Contabilità per CDC - UACD'!Y36","v":0},{"$f":"SUM('Contabilità per CDC - UACD'!AB36:AF36,'Contabilità per CDC - UACD'!AI36)","v":0},{"$f":"SUM('Contabilità per CDC - UACD'!AG36:AH36,'Contabilità per CDC - UACD'!AJ36)","v":0},{"$f":"SUM('Contabilità per CDC - UACD'!AK36:AO36)","v":0}]
[{"$f":"'Contabilità per CDC - UACD'!A37","v":47},{"$f":"'Contabilità per CDC - UACD'!B37","v":"Costi amministrativi e di informatica"},{"$f":"'Contabilità per CDC - UACD'!R37","v":0},{"$f":"'Contabilità per CDC - UACD'!S37","v":0},{"$f":"IF(AND(G37=0,'Contabilità per CDC - UACD'!T37=0),0,100%-G37)","v":1},{"$f":"'Contabilità per CDC - UACD'!T37*E37","v":500},0,{"$f":"'Contabilità per CDC - UACD'!T37*G37","v":0},{"$f":"'Contabilità per CDC - UACD'!U37","v":250},{"$f":"'Contabilità per CDC - UACD'!V37","v":250},{"$f":"'Contabilità per CDC - UACD'!W37","v":0},{"$f":"'Contabilità per CDC - UACD'!X37","v":0},{"$f":"'Contabilità per CDC - UACD'!Z37","v":0},{"$f":"'Contabilità per CDC - UACD'!Y37","v":0},{"$f":"SUM('Contabilità per CDC - UACD'!AB37:AF37,'Contabilità per CDC - UACD'!AI37)","v":0},{"$f":"SUM('Contabilità per CDC - UACD'!AG37:AH37,'Contabilità per CDC - UACD'!AJ37)","v":0},{"$f":"SUM('Contabilità per CDC - UACD'!AK37:AO37)","v":500}]
[{"$f":"'Contabilità per CDC - UACD'!A38","v":48},{"$f":"'Contabilità per CDC - UACD'!B38","v":"Altri costi relativi ai residenti"},{"$f":"'Contabilità per CDC - UACD'!R38","v":5900},{"$f":"'Contabilità per CDC - UACD'!S38","v":1500},{"$f":"IF(AND(G38=0,'Contabilità per CDC - UACD'!T38=0),0,100%-G38)","v":0},{"$f":"'Contabilità per CDC - UACD'!T38*E38","v":0},0,{"$f":"'Contabilità per CDC - UACD'!T38*G38","v":0},{"$f":"'Contabilità per CDC - UACD'!U38","v":0},{"$f":"'Contabilità per CDC - UACD'!V38","v":0},{"$f":"'Contabilità per CDC - UACD'!W38","v":0},{"$f":"'Contabilità per CDC - UACD'!X38","v":0},{"$f":"'Contabilità per CDC - UACD'!Z38","v":0},{"$f":"'Contabilità per CDC - UACD'!Y38","v":0},{"$f":"SUM('Contabilità per CDC - UACD'!AB38:AF38,'Contabilità per CDC - UACD'!AI38)","v":0},{"$f":"SUM('Contabilità per CDC - UACD'!AG38:AH38,'Contabilità per CDC - UACD'!AJ38)","v":0},{"$f":"SUM('Contabilità per CDC - UACD'!AK38:AO38)","v":1200}]
[{"$f":"'Contabilità per CDC - UACD'!A39","v":49},{"$f":"'Contabilità per CDC - UACD'!B39","v":"Altri costi non relativi ai residenti"},{"$f":"'Contabilità per CDC - UACD'!R39","v":0},{"$f":"'Contabilità per CDC - UACD'!S39","v":4500},{"$f":"IF(AND(G39=0,'Contabilità per CDC - UACD'!T39=0),0,100%-G39)","v":1},{"$f":"'Contabilità per CDC - UACD'!T39*E39","v":500},0,{"$f":"'Contabilità per CDC - UACD'!T39*G39","v":0},{"$f":"'Contabilità per CDC - UACD'!U39","v":300},{"$f":"'Contabilità per CDC - UACD'!V39","v":200},{"$f":"'Contabilità per CDC - UACD'!W39","v":0},{"$f":"'Contabilità per CDC - UACD'!X39","v":0},{"$f":"'Contabilità per CDC - UACD'!Z39","v":0},{"$f":"'Contabilità per CDC - UACD'!Y39","v":0},{"$f":"SUM('Contabilità per CDC - UACD'!AB39:AF39,'Contabilità per CDC - UACD'!AI39)","v":0},{"$f":"SUM('Contabilità per CDC - UACD'!AG39:AH39,'Contabilità per CDC - UACD'!AJ39)","v":0},{"$f":"SUM('Contabilità per CDC - UACD'!AK39:AO39)","v":15000}]
[null,"Costi lordi prima delle ripartizioni",{"$f":"SUM(C9:C39)","v":37900},{"$f":"SUM(D9:D39)","v":274363.03501945524},null,{"$f":"SUM(F9:F39)","v":77793.341980112426},null,{"$f":"SUM(H9:H39)","v":3098040.8560311282},14267.336792044964,26484.673584089927,49269.347168179855,24734.673584089927,15000,60000,1534873.757025508,0,1421411.5150410724]
[null,"Riduzione dei costi, ricavi accessori compresi"]
[65,"Altri ricavi da prestazioni ai residenti",{"$f":"'Contabilità per CDC - UACD'!R42","v":-800},{"$f":"'Contabilità per CDC - UACD'!S42","v":-4000},{"$f":"IF(AND(G42=0,'Contabilità per CDC - UACD'!T42=0),0,100%-G42)","v":0},{"$f":"'Contabilità per CDC - UACD'!T42*E42","v":0},0,{"$f":"'Contabilità per CDC - UACD'!T399*G42","v":0},{"$f":"'Contabilità per CDC - UACD'!U42","v":0},{"$f":"'Contabilità per CDC - UACD'!V42","v":0},{"$f":"'Contabilità per CDC - UACD'!W42","v":0},{"$f":"'Contabilità per CDC - UACD'!X42","v":0},{"$f":"'Contabilità per CDC - UACD'!Z42","v":0},{"$f":"'Contabilità per CDC - UACD'!Y42","v":0},{"$f":"SUM('Contabilità per CDC - UACD'!AB42:AF42,'Contabilità per CDC - UACD'!AI42)","v":0},{"$f":"SUM('Contabilità per CDC - UACD'!AG42:AH42,'Contabilità per CDC - UACD'!AJ42)","v":0},{"$f":"SUM('Contabilità per CDC - UACD'!AK42:AO42)","v":0}]
[66,"Ricavi finanziari",{"$f":"'Contabilità per CDC - UACD'!R43","v":0},{"$f":"'Contabilità per CDC - UACD'!S43","v":0},{"$f":"IF(AND(G43=0,'Contabilità per CDC - UACD'!T43=0),0,100%-G43)","v":0},{"$f":"'Contabilità per CDC - UACD'!T43*E43","v":0},0,{"$f":"'Contabilità per CDC - UACD'!T400*G43","v":0},{"$f":"'Contabilità per CDC - UACD'!U43","v":0},{"$f":"'Contabilità per CDC - UACD'!V43","v":0},{"$f":"'Contabilità per CDC - UACD'!W43","v":0},{"$f":"'Contabilità per CDC - UACD'!X43","v":0},{"$f":"'Contabilità per CDC - UACD'!Z43","v":0},{"$f":"'Contabilità per CDC - UACD'!Y43","v":0},{"$f":"SUM('Contabilità per CDC - UACD'!AB43:AF43,'Contabilità per CDC - UACD'!AI43)","v":0},{"$f":"SUM('Contabilità per CDC - UACD'!AG43:AH43,'Contabilità per CDC - UACD'!AJ43)","v":0},{"$f":"SUM('Contabilità per CDC - UACD'!AK43:AO43)","v":0}]
[68,"Ricavi da prestazioni fornite al personale e a terzi",{"$f":"'Contabilità per CDC - UACD'!R44","v":0},{"$f":"'Contabilità per CDC - UACD'!S44","v":0},{"$f":"IF(AND(G44=0,'Contabilità per CDC - UACD'!T44=0),0,100%-G44)","v":0},{"$f":"'Contabilità per CDC - UACD'!T44*E44","v":0},0,{"$f":"'Contabilità per CDC - UACD'!T401*G44","v":0},{"$f":"'Contabilità per CDC - UACD'!U44","v":0},{"$f":"'Contabilità per CDC - UACD'!V44","v":0},{"$f":"'Contabilità per CDC - UACD'!W44","v":0},{"$f":"'Contabilità per CDC - UACD'!X44","v":0},{"$f":"'Contabilità per CDC - UACD'!Z44","v":0},{"$f":"'Contabilità per CDC - UACD'!Y44","v":0},{"$f":"SUM('Contabilità per CDC - UACD'!AB44:AF44,'Contabilità per CDC - UACD'!AI44)","v":0},{"$f":"SUM('Contabilità per CDC - UACD'!AG44:AH44,'Contabilità per CDC - UACD'!AJ44)","v":0},{"$f":"SUM('Contabilità per CDC - UACD'!AK44:AO44)","v":0}]
[7,"Imposte, risultato estraneo all'esercizio e straordinario",{"$f":"'Contabilità per CDC - UACD'!R45","v":0},{"$f":"'Contabilità per CDC - UACD'!S45","v":0},{"$f":"IF(AND(G45=0,'Contabilità per CDC - UACD'!T45=0),0,100%-G45)","v":0},{"$f":"'Contabilità per CDC - UACD'!T45*E45","v":0},0,{"$f":"'Contabilità per CDC - UACD'!T402*G45","v":0},{"$f":"'Contabilità per CDC - UACD'!U45","v":0},{"$f":"'Contabilità per CDC - UACD'!V45","v":0},{"$f":"'Contabilità per CDC - UACD'!W45","v":0},{"$f":"'Contabilità per CDC - UACD'!X45","v":0},{"$f":"'Contabilità per CDC - UACD'!Z45","v":0},{"$f":"'Contabilità per CDC - UACD'!Y45","v":0},{"$f":"SUM('Contabilità per CDC - UACD'!AB45:AF45,'Contabilità per CDC - UACD'!AI45)","v":0},{"$f":"SUM('Contabilità per CDC - UACD'!AG45:AH45,'Contabilità per CDC - UACD'!AJ45)","v":0},{"$f":"SUM('Contabilità per CDC - UACD'!AK45:AO45)","v":0}]
[null,"Costi netti prima delle ripartizioni ",{"$f":"SUM(C42:C45)+C40","v":37100},{"$f":"SUM(D42:D45)+D40","v":270363.03501945524},null,{"$f":"SUM(F42:F45)+F40","v":77793.341980112426},null,{"$f":"SUM(H42:H45)+H40","v":3098040.8560311282},{"$f":"SUM(I42:I45)+I40","v":14267.336792044964},{"$f":"SUM(J42:J45)+J40","v":26484.673584089927},49269.347168179855,24734.673584089927,15000,60000,{"$f":"SUM(O42:O45)+O40","v":1534873.757025508},{"$f":"SUM(P42:P45)+P40","v":0},{"$f":"SUM(Q42:Q45)+Q40","v":1421411.5150410724}]
[null,"Ripartizioni sui centri di costo generali e principali"]
["RIP010","Ripartizione Edifici",{"$f":"'Contabilità per CDC - UACD'!R48","v":59095.860566448799},{"$f":"'Contabilità per CDC - UACD'!S48","v":2836.6013071895422},{"$f":"IF(AND(G48=0,'Contabilità per CDC - UACD'!T48=0),0,100%-G48)","v":1},{"$f":"'Contabilità per CDC - UACD'!T48*E48","v":2363.834422657952},0,{"$f":"'Contabilità per CDC - UACD'!T48*G48","v":0},{"$f":"'Contabilità per CDC - UACD'!U48","v":472.76688453159039},{"$f":"'Contabilità per CDC - UACD'!V48","v":590.958605664488},{"$f":"'Contabilità per CDC - UACD'!W48","v":0},{"$f":"'Contabilità per CDC - UACD'!X48","v":0},{"$f":"'Contabilità per CDC - UACD'!Z48","v":0},{"$f":"'Contabilità per CDC - UACD'!Y48","v":0},{"$f":"SUM('Contabilità per CDC - UACD'!AB48:AF48,'Contabilità per CDC - UACD'!AI48)","v":20092.592592592591},{"$f":"SUM('Contabilità per CDC - UACD'!AG48:AH48,'Contabilità per CDC - UACD'!AJ48)","v":0},{"$f":"SUM('Contabilità per CDC - UACD'!AK48:AO48)","v":0}]
["RIP011","Ripartizione Energia",{"$f":"'Contabilità per CDC - UACD'!R49","v":70919.263278273065},{"$f":"'Contabilità per CDC - UACD'!S49","v":3404.1246373571071},{"$f":"IF(AND(G49=0,'Contabilità per CDC - UACD'!T49=0),0,100%-G49)","v":1},{"$f":"'Contabilità per CDC - UACD'!T49*E49","v":2836.7705311309228},0,{"$f":"'Contabilità per CDC - UACD'!T49*G49","v":0},{"$f":"'Contabilità per CDC - UACD'!U49","v":567.35410622618451},{"$f":"'Contabilità per CDC - UACD'!V49","v":709.1926327827307},{"$f":"'Contabilità per CDC - UACD'!W49","v":0},{"$f":"'Contabilità per CDC - UACD'!X49","v":0},{"$f":"'Contabilità per CDC - UACD'!Z49","v":0},{"$f":"'Contabilità per CDC - UACD'!Y49","v":0},{"$f":"SUM('Contabilità per CDC - UACD'!AB49:AF49,'Contabilità per CDC - UACD'!AI49)","v":24112.549514612841},{"$f":"SUM('Contabilità per CDC - UACD'!AG49:AH49,'Contabilità per CDC - UACD'!AJ49)","v":0},{"$f":"SUM('Contabilità per CDC - UACD'!AK49:AO49)","v":0}]
["RIP020","Ripartizione Servizi tecnici",{"$f":"'Contabilità per CDC - UACD'!R50","v":58259.557296802319},{"$f":"'Contabilità per CDC - UACD'!S50","v":2796.4587502465115},{"$f":"IF(AND(G50=0,'Contabilità per CDC - UACD'!T50=0),0,100%-G50)","v":1},{"$f":"'Contabilità per CDC - UACD'!T50*E50","v":2330.382291872093},0,{"$f":"'Contabilità per CDC - UACD'!T50*G50","v":0},{"$f":"'Contabilità per CDC - UACD'!U50","v":466.07645837441856},{"$f":"'Contabilità per CDC - UACD'!V50","v":582.59557296802325},{"$f":"'Contabilità per CDC - UACD'!W50","v":0},{"$f":"'Contabilità per CDC - UACD'!X50","v":0},{"$f":"'Contabilità per CDC - UACD'!Z50","v":0},{"$f":"'Contabilità per CDC - UACD'!Y50","v":0},{"$f":"SUM('Contabilità per CDC - UACD'!AB50:AF50,'Contabilità per CDC - UACD'!AI50)","v":19808.249480912789},{"$f":"SUM('Contabilità per CDC - UACD'!AG50:AH50,'Contabilità per CDC - UACD'!AJ50)","v":0},{"$f":"SUM('Contabilità per CDC - UACD'!AK50:AO50)","v":0}]
["RIP021","Ripartizione Servizio trasporti",{"$f":"'Contabilità per CDC - UACD'!R51","v":0},{"$f":"'Contabilità per CDC - UACD'!S51","v":236.84210526315789},{"$f":"IF(AND(G51=0,'Contabilità per CDC - UACD'!T51=0),0,100%-G51)","v":1},{"$f":"'Contabilità per CDC - UACD'!T51*E51","v":789.47368421052636},0,{"$f":"'Contabilità per CDC - UACD'!T51*G51","v":0},{"$f":"'Contabilità per CDC - UACD'!U51","v":0},{"$f":"'Contabilità per CDC - UACD'!V51","v":0},{"$f":"'Contabilità per CDC - UACD'!W51","v":0},{"$f":"'Contabilità per CDC - UACD'!X51","v":0},{"$f":"'Contabilità per CDC - UACD'!Z51","v":0},{"$f":"'Contabilità per CDC - UACD'!Y51","v":0},{"$f":"SUM('Contabilità per CDC - UACD'!AB51:AF51,'Contabilità per CDC - UACD'!AI51)","v":0},{"$f":"SUM('Contabilità per CDC - UACD'!AG51:AH51,'Contabilità per CDC - UACD'!AJ51)","v":0},{"$f":"SUM('Contabilità per CDC - UACD'!AK51:AO51)","v":0}]
["RIP030","Ripartizione Direzione / Amministrazione",{"$f":"'Contabilità per CDC - UACD'!R52","v":0},{"$f":"'Contabilità per CDC - UACD'!S52","v":18547.808102940893},{"$f":"IF(AND(G52=0,'Contabilità per CDC - UACD'!T52=0),0,100%-G52)","v":1},{"$f":"'Contabilità per CDC - UACD'!T52*E52","v":218058.60148685699},0,{"$f":"'Contabilità per CDC - UACD'!T52*G52","v":0},{"$f":"'Contabilità per CDC - UACD'!U52","v":855.13177053669403},{"$f":"'Contabilità per CDC - UACD'!V52","v":1710.2635410733881},{"$f":"'Contabilità per CDC - UACD'!W52","v":3420.5270821467761},{"$f":"'Contabilità per CDC - UACD'!X52","v":1710.2635410733881},{"$f":"'Contabilità per CDC - UACD'!Z52","v":0},{"$f":"'Contabilità per CDC - UACD'!Y52","v":0},{"$f":"SUM('Contabilità per CDC - UACD'!AB52:AF52,'Contabilità per CDC - UACD'!AI52)","v":104753.64189074503},{"$f":"SUM('Contabilità per CDC - UACD'!AG52:AH52,'Contabilità per CDC - UACD'!AJ52)","v":0},{"$f":"SUM('Contabilità per CDC - UACD'!AK52:AO52)","v":0}]
["RIP040","Ripartizione Economia domestica in generale",{"$f":"'Contabilità per CDC - UACD'!R53","v":0},{"$f":"'Contabilità per CDC - UACD'!S53","v":3637.7790087192357},{"$f":"IF(AND(G53=0,'Contabilità per CDC - UACD'!T53=0),0,100%-G53)","v":1},{"$f":"'Contabilità per CDC - UACD'!T53*E53","v":42767.803007072616},0,{"$f":"'Contabilità per CDC - UACD'!T53*G53","v":0},{"$f":"'Contabilità per CDC - UACD'!U53","v":167.71687453753967},{"$f":"'Contabilità per CDC - UACD'!V53","v":335.43374907507933},{"$f":"'Contabilità per CDC - UACD'!W53","v":670.86749815015867},{"$f":"'Contabilità per CDC - UACD'!X53","v":335.43374907507933},{"$f":"'Contabilità per CDC - UACD'!Z53","v":0},{"$f":"'Contabilità per CDC - UACD'!Y53","v":0},{"$f":"SUM('Contabilità per CDC - UACD'!AB53:AF53,'Contabilità per CDC - UACD'!AI53)","v":20545.317130848613},{"$f":"SUM('Contabilità per CDC - UACD'!AG53:AH53,'Contabilità per CDC - UACD'!AJ53)","v":0},{"$f":"SUM('Contabilità per CDC - UACD'!AK53:AO53)","v":0}]
["RIP041","Ripartizione Lavanderia",{"$f":"'Contabilità per CDC - UACD'!R54","v":249711.97654323734},{"$f":"'Contabilità per CDC - UACD'!S54","v":1920.8613580249025},{"$f":"IF(AND(G54=0,'Contabilità per CDC - UACD'!T54=0),0,100%-G54)","v":1},{"$f":"'Contabilità per CDC - UACD'!T54*E54","v":28812.920370373537},0,{"$f":"'Contabilità per CDC - UACD'!T54*G54","v":0},{"$f":"'Contabilità per CDC - UACD'!U54","v":384.17227160498049},{"$f":"'Contabilità per CDC - UACD'!V54","v":480.21533950622563},{"$f":"'Contabilità per CDC - UACD'!W54","v":0},{"$f":"'Contabilità per CDC - UACD'!X54","v":0},{"$f":"'Contabilità per CDC - UACD'!Z54","v":0},{"$f":"'Contabilità per CDC - UACD'!Y54","v":0},{"$f":"SUM('Contabilità per CDC - UACD'!AB54:AF54,'Contabilità per CDC - UACD'!AI54)","v":82597.038395070806},{"$f":"SUM('Contabilità per CDC - UACD'!AG54:AH54,'Contabilità per CDC - UACD'!AJ54)","v":0},{"$f":"SUM('Contabilità per CDC - UACD'!AK54:AO54)","v":0}]
["RIP042","Ripartizione Pulizie",{"$f":"'Contabilità per CDC - UACD'!R55","v":218650.89815545426},{"$f":"'Contabilità per CDC - UACD'!S55","v":10495.243111461803},{"$f":"IF(AND(G55=0,'Contabilità per CDC - UACD'!T55=0),0,100%-G55)","v":1},{"$f":"'Contabilità per CDC - UACD'!T55*E55","v":8746.0359262181701},0,{"$f":"'Contabilità per CDC - UACD'!T55*G55","v":0},{"$f":"'Contabilità per CDC - UACD'!U55","v":1749.2071852436338},{"$f":"'Contabilità per CDC - UACD'!V55","v":2186.5089815545425},{"$f":"'Contabilità per CDC - UACD'!W55","v":0},{"$f":"'Contabilità per CDC - UACD'!X55","v":0},{"$f":"'Contabilità per CDC - UACD'!Z55","v":0},{"$f":"'Contabilità per CDC - UACD'!Y55","v":0},{"$f":"SUM('Contabilità per CDC - UACD'!AB55:AF55,'Contabilità per CDC - UACD'!AI55)","v":74341.305372854447},{"$f":"SUM('Contabilità per CDC - UACD'!AG55:AH55,'Contabilità per CDC - UACD'!AJ55)","v":0},{"$f":"SUM('Contabilità per CDC - UACD'!AK55:AO55)","v":0}]
["RIP060","Ripartizione Cucina",{"$f":"'Contabilità per CDC - UACD'!R56","v":997314.90970283898},{"$f":"'Contabilità per CDC - UACD'!S56","v":0},{"$f":"IF(AND(G56=0,'Contabilità per CDC - UACD'!T56=0),0,100%-G56)","v":0},{"$f":"'Contabilità per CDC - UACD'!T56*E56","v":0},0,{"$f":"'Contabilità per CDC - UACD'!T56*G56","v":0},{"$f":"'Contabilità per CDC - UACD'!U56","v":0},{"$f":"'Contabilità per CDC - UACD'!V56","v":0},{"$f":"'Contabilità per CDC - UACD'!W56","v":0},{"$f":"'Contabilità per CDC - UACD'!X56","v":0},{"$f":"'Contabilità per CDC - UACD'!Z56","v":0},{"$f":"'Contabilità per CDC - UACD'!Y56","v":0},{"$f":"SUM('Contabilità per CDC - UACD'!AB56:AF56,'Contabilità per CDC - UACD'!AI56)","v":153076.24195438923},{"$f":"SUM('Contabilità per CDC - UACD'!AG56:AH56,'Contabilità per CDC - UACD'!AJ56)","v":0},{"$f":"SUM('Contabilità per CDC - UACD'!AK56:AO56)","v":0}]
["RIP090","Ripartizione Magazzino centrale",{"$f":"'Contabilità per CDC - UACD'!R57","v":0},{"$f":"'Contabilità per CDC - UACD'!S57","v":0},{"$f":"IF(AND(G57=0,'Contabilità per CDC - UACD'!T57=0),0,100%-G57)","v":0},{"$f":"'Contabilità per CDC - UACD'!T57*E57","v":0},0,{"$f":"'Contabilità per CDC - UACD'!T57*G57","v":0},{"$f":"'Contabilità per CDC - UACD'!U57","v":0},{"$f":"'Contabilità per CDC - UACD'!V57","v":0},{"$f":"'Contabilità per CDC - UACD'!W57","v":0},{"$f":"'Contabilità per CDC - UACD'!X57","v":0},{"$f":"'Contabilità per CDC - UACD'!Z57","v":0},{"$f":"'Contabilità per CDC - UACD'!Y57","v":0},{"$f":"SUM('Contabilità per CDC - UACD'!AB57:AF57,'Contabilità per CDC - UACD'!AI57)","v":0},{"$f":"SUM('Contabilità per CDC - UACD'!AG57:AH57,'Contabilità per CDC - UACD'!AJ57)","v":0},{"$f":"SUM('Contabilità per CDC - UACD'!AK57:AO57)","v":0}]
["RIP095","Ripartizione Farmacia",{"$f":"'Contabilità per CDC - UACD'!R58","v":0},{"$f":"'Contabilità per CDC - UACD'!S58","v":0},{"$f":"IF(AND(G58=0,'Contabilità per CDC - UACD'!T58=0),0,100%-G58)","v":0},{"$f":"'Contabilità per CDC - UACD'!T58*E58","v":0},0,{"$f":"'Contabilità per CDC - UACD'!T58*G58","v":0},{"$f":"'Contabilità per CDC - UACD'!U58","v":0},{"$f":"'Contabilità per CDC - UACD'!V58","v":0},{"$f":"'Contabilità per CDC - UACD'!W58","v":0},{"$f":"'Contabilità per CDC - UACD'!X58","v":0},{"$f":"'Contabilità per CDC - UACD'!Z58","v":1990.6914893617022},{"$f":"'Contabilità per CDC - UACD'!Y58","v":1592.5531914893618},{"$f":"SUM('Contabilità per CDC - UACD'!AB58:AF58,'Contabilità per CDC - UACD'!AI58)","v":1406.7553191489362},{"$f":"SUM('Contabilità per CDC - UACD'!AG58:AH58,'Contabilità per CDC - UACD'!AJ58)","v":0},{"$f":"SUM('Contabilità per CDC - UACD'!AK58:AO58)","v":0}]
[null,"Costi netti dopo ripartizioni",{"$f":"SUM(C46:C58)","v":1691052.465543055},{"$f":"SUM(D46:D58)","v":314238.75340065843},null,{"$f":"SUM(F46:F58)","v":384499.16370050516},null,{"$f":"SUM(H46:H58)","v":3098040.8560311282},{"$f":"SUM(I46:I58)","v":18929.762343100007},{"$f":"SUM(J46:J58)","v":33079.842006714411},53360.741748476794,26780.370874238397,16990.691489361703,61592.553191489365,2035607.4486766832,0,1421411.5150410724]

{"sheet":"Contabilità per UFI 2","index":6,"n_rows":60,"n_cols":25,"rows_kept":60,"cut":false,"hidden":false,"merged":[[46,23,57,23],[46,24,57,24],[42,0,43,0],[42,11,43,11],[42,13,43,13],[46,0,57,0],[46,10,57,10],[46,11,57,11],[46,13,57,13],[29,23,33,23],[29,24,33,24],[30,0,35,0],[30,11,35,11],[30,13,35,13],[34,10,38,10],[34,23,38,23],[34,24,38,24],[36,0,41,0],[36,11,41,11],[36,13,41,13],[39,10,43,10],[39,23,43,23],[39,24,43,24],[20,24,24,24],[24,0,26,0],[24,11,26,11],[24,13,26,13],[25,10,28,10],[20,0,23,0],[20,10,24,10],[20,11,23,11],[20,13,23,13],[20,23,24,23],[25,23,28,23],[25,24,28,24],[27,0,29,0],[27,11,29,11],[27,13,29,13],[29,10,33,10],[14,13,15,13],[14,23,15,23],[14,24,15,24],[16,0,19,0],[16,10,19,10],[16,11,19,11],[16,13,19,13],[16,23,19,23],[16,24,19,24],[14,11,15,11],[4,0,4,5],[5,0,5,5],[6,0,6,5],[14,0,15,0],[14,10,15,10]]}
["Contabilità per unità finali d'imputazione 2 (UACD)"]
[{"$f":"Parametri!$B$7","v":2021},{"$f":"Parametri!$B$3","v":"ESEMPIO - CPA STANDARD CON CAT-STT"}]
[]
["Calcolo dei costi",null,null,null,null,null,null,"Alberghiero",null,"Animazione",null,"Cura non LAMal",null,"Cura LAMal",null,"Terapia LAMal",null,"Medico LAMal",null,"Materiale EMAp",null,"Medicamenti ES",null,"Costi totali"]
["Costi d'esercizio in CHF.:",null,null,null,null,null,null,{"$f":"'Contabilità per UFI 1'!C59","v":1691052.465543055},null,{"$f":"'Contabilità per UFI 1'!D59","v":314238.75340065843},null,{"$f":"'Contabilità per UFI 1'!F59","v":384499.16370050516},null,{"$f":"'Contabilità per UFI 1'!H59","v":3098040.8560311282},null,{"$f":"'Contabilità per UFI 1'!I59","v":18929.762343100007},null,{"$f":"'Contabilità per UFI 1'!L59","v":26780.370874238397},null,{"$f":"'Contabilità per UFI 1'!N59","v":61592.553191489365},null,{"$f":"'Contabilità per UFI 1'!M59","v":16990.691489361703},null,{"$f":"SUM(H5:V5)","v":5612124.6165735368}]
["Giornate di soggiorno effettive (gs)/ giornate di soggiorno ponderate (gp):",null,null,null,null,null,null,{"$f":"$D$60","v":21500},null,{"$f":"$D$60","v":21500},null,{"$f":"$D$60","v":21500},null,{"$f":"$E$60","v":25063.081999999995},null,{"$f":"$D$60","v":21500},null,{"$f":"$D$60","v":21500},null,{"$f":"$D$60","v":21500},null,{"$f":"$D$60","v":21500}]
["Costo per giornata di soggiorno (gs, gp) in CHF:.",null,null,null,null,null,null,{"$f":"H5/H6","v":78.653603048514185},null,{"$f":"J5/J6","v":14.615755972123647},null,{"$f":"L5/L6","v":17.883682032581635},null,{"$f":"N5/N6","v":123.6097322759878},null,{"$f":"P5/P6","v":0.88045406246976776},null,{"$f":"R5/R6","v":1.2455986453134138},null,{"$f":"T5/T6","v":2.8647699158832265},null,{"$f":"V5/V6","v":0.79026472043542806}]
[]
[null,"Gruppo RUG","Indice\nCH","Giornate di soggiorno","Giornate ponderate"]
[]
["Grado 0",null,null,0,null,null,null,{"$f":"H7","v":78.653603048514185},null,{"$f":"J7","v":14.615755972123647},null,{"$f":"L7","v":17.883682032581635},null,null,null,{"$f":"P7","v":0.88045406246976776},null,{"$f":"R7","v":1.2455986453134138},null,{"$f":"T7","v":2.8647699158832265},null,{"$f":"V7","v":0.79026472043542806},null,{"$f":"SUM(H11:V11)","v":116.9341283973213},0]
[]
["Grado 1","PA0",0.129,169,{"$f":"D13*C13","v":21.801000000000002},{"$f":"SUM(IF(E13=0,0,$N$7*E13/D13))","v":15.945655463602426},null,null,null,null,null,"Grado 1",null,{"$f":"FLOOR(F13*D13/D13+0.025,0.05)","v":15.950000000000001},null,null,null,null,null,null,null,null,null,{"$f":"SUM($H$11:$V$11)+N13","v":132.88412839732129},1]
["Grado 2","PA1",0.33200000000000002,2153,714.79600000000005,41.038431115627951,null,null,null,null,null,"Grado 2",null,{"$f":"FLOOR(F14*D14/D14+0.025,0.05)","v":41.050000000000004},null,null,null,null,null,null,null,null,null,{"$f":"SUM($H$11:$V$11)+N14","v":157.98412839732131},2]
["Grado 3","BA1",0.42699999999999999,540,230.57999999999998,52.781355681846783,null,null,null,null,null,"Grado 3",null,{"$f":"FLOOR((F15*D15+F16*D16)/(D15+D16)+0.025,0.05)","v":53.050000000000004},null,null,null,null,null,null,null,null,null,{"$f":"SUM($H$11:$V$11)+N15","v":169.98412839732131},3]
[null,"PA2",0.437,134,58.558,54.017453004606665]
["Grado 4","IA1",0.58199999999999996,500,291,71.9408641846249,null,null,null,null,null,"Grado 4",null,{"$f":"FLOOR((F17*D17+F18*D18+F19*D19+F20*D20)/(D17+D18+D19+D20)+0.025,0.05)","v":77.150000000000006},null,null,null,null,null,null,null,null,null,{"$f":"SUM($H$11:$V$11)+N17","v":194.08412839732131},4]
[null,"BA2",0.60499999999999998,null,0,0]
[null,"PB1",0.65900000000000003,606,399.35400000000004,81.458813569875971,null,null,null,null,null,null,null,{"$f":"(F19*D19+F20*D20)/(D19+D20)","v":81.458813569875971},null,null,null,null,null,null,null,null,null,{"$f":"(V19*T19+V20*T20)/(T19+T20)","v":{"$error":"#DIV/0!"}}]
[null,"PB2",0.67900000000000005,null,0,0]
["Grado 5","BB1",0.81299999999999994,451,366.66299999999995,100.49471234037807,null,null,null,null,null,"Grado 5",null,{"$f":"FLOOR((F21*D21+F22*D22+F23*D23+F24*D24)/(D21+D22+D23+D24)+0.025,0.05)","v":105.15},null,null,null,null,null,null,null,null,null,{"$f":"SUM($H$11:$V$11)+N21","v":222.08412839732131},5]
[null,"CA1",0.82599999999999996,83,68.557999999999993,102.1016388599659]
[null,"IB1",0.85899999999999999,1326,1139.0339999999999,106.1807600250735]
[null,"PC1",0.86199999999999999,694,598.22799999999995,106.55158922190148]
["Grado 6","BB2",0.90700000000000003,null,0,0,null,null,null,null,null,"Grado 6",null,{"$f":"FLOOR((F25*D25+F26*D26+F27*D27)/(D25+D26+D27)+0.025,0.05)","v":119.05000000000001}]
[null,"PC2",0.96299999999999997,112,107.85599999999999,119.03617218177624,null,null,null,null,null,null,null,null,null,null,null,null,null,null,null,null,null,{"$f":"SUM($H$11:$V$11)+N25","v":235.98412839732131},6]
[null,"IA2",1.014,null,0,0]
["Grado 7","IB2",1.113,769,855.89700000000005,137.57763202317443,null,null,null,null,null,"Grado 7",null,{"$f":"(F28*D28+F29*D29+F30*D30)/(D28+D29+D30)","v":148.55161951753865},null,null,null,null,null,null,null,null,null,{"$f":"(V28*T28+V29*T29)/(T28+T29)","v":{"$error":"#DIV/0!"}}]
[null,"CA2",1.145,226,258.77,141.533143456006]
[null,"PD1",1.218,5000,6090,150.55665391215314,null,null,null,null,null,null,null,null,null,null,null,null,null,null,null,null,null,{"$f":"SUM($H$11:$V$11)+N30","v":116.9341283973213},7]
["Grado 8","PD2",1.2290000000000001,22,27.038000000000004,151.91636096718901,null,null,null,null,null,"Grado 8",null,{"$f":"FLOOR((F35*D35+F36*D36+F31*D31+F32*D32+F33*D33+F34*D34)/(D35+D36+D31+D32+D33+D34)+0.025,0.05)","v":165.95000000000002}]
[null,"CB1",1.2390000000000001,null,0,0]
[null,"RMA",1.2829999999999999,61,78.262999999999991,158.59128651009232]
[null,"RLA",1.3,183,237.9,160.69265195878413]
[null,"CB2",1.3380000000000001,214,286.33199999999999,165.38982178527166,null,null,null,null,null,null,null,null,null,null,null,null,null,null,null,null,null,{"$f":"SUM($H$11:$V$11)+N31","v":282.88412839732132},8]
[null,"SSA",1.3779999999999999,418,576.00399999999991,170.33421107631116]
["Grado 9","RMB",1.417,97,137.44900000000001,175.15499063507471,null,null,null,null,null,"Grado 9",null,{"$f":"FLOOR((F40*D40+F41*D41+F42*D42+F37*D37+F38*D38+F39*D39)/(D40+D41+D42+D37+D38+D39)+0.025,0.05)","v":190.3}]
[null,"CC1",1.464,null,0,0]
[null,"SSB",1.5149999999999999,null,0,0]
[null,"PE1",1.5409999999999999,6047,9318.4269999999997,190.48259743729719,null,null,null,null,null,null,null,null,null,null,null,null,null,null,null,null,null,{"$f":"SUM($H$11:$V$11)+N37","v":307.23412839732134},9]
[null,"RLB",1.5509999999999999,60,93.06,191.71869476005708]
[null,"CC2",1.56,157,244.92000000000002,192.83118235054098]
["Grado 10","PE2",1.587,34,53.957999999999998,196.16864512199263,null,null,null,null,null,"Grado 10",null,{"$f":"FLOOR((F43*D43+F44*D44)/(D43+D44)+0.025,0.05)","v":196.15}]
[null,"SE1",1.651,null,0,0]
["Grado 11","SSC",1.7989999999999999,1084,1950.116,222.37390836450203,null,null,null,null,null,"Grado 11",null,{"$f":"FLOOR(F45*D45/D45+0.025,0.05)","v":222.35000000000002},null,null,null,null,null,null,null,null,null,{"$f":"SUM($H$11:$V$11)+N45","v":339.2841283973213},10]
[null,null,null,null,null,null,null,null,null,null,null,null,null,null,null,null,null,null,null,null,null,null,null,null,11]
["Grado 12","RUC",2.1459999999999999,null,0,{"$f":"SUM(IF(E47=0,0,$N$7*E47/D47))","v":0},null,null,null,null,null,"Grado 12",null,{"$f":"FLOOR((F47*D47+F48*D48+F49*D49+F50*D50+F51*D51+F52*D52+F53*D53+F54*D54+F55*D55+F56*D56+F57*D57+F58*D58)/(D47+D48+D49+D50+D51+D52+D53+D54+D55+D56+D57+D58)+0.025,0.05)","v":294.8},null,null,null,null,null,null,null,null,null,{"$f":"SUM($H$11:$V$11)+N47","v":411.73412839732134},12]
[null,"RUB",2.1459999999999999,null,0,0]
[null,"RUA",2.1459999999999999,null,0,0]
[null,"RVC",2.1459999999999999,null,0,0]
[null,"RVB",2.1459999999999999,null,0,0]
[null,"RVA",2.1459999999999999,null,0,0]
[null,"RHC",2.1459999999999999,null,0,0]
[null,"RHB",2.1459999999999999,null,0,0]
[null,"RHA",2.1459999999999999,null,0,0]
[null,"RMC",2.1459999999999999,304,652.38400000000001,265.26648546426981]
[null,"SE2",2.4569999999999999,null,0,0]
[null,"SE3",3.681,56,206.136,455.00742450791103]
[]
["Totale",null,null,{"$f":"SUM(D13:D58)","v":21500},{"$f":"SUM(E13:E58)","v":25063.081999999995},{"$f":"E60/D60","v":1.1657247441860463}]

{"sheet":"Contabilità per CDC - SOMED","index":7,"n_rows":76,"n_cols":64,"rows_kept":76,"cut":false,"hidden":false,"merged":[[59,27,59,28],[48,27,48,28],[49,27,49,28],[50,27,50,28],[56,27,56,28],[57,27,57,28],[51,27,51,28],[52,27,52,28],[53,27,53,28],[54,27,54,28],[55,27,55,28],[4,47,4,57],[4,58,4,59],[4,5,4,15],[4,17,4,25],[4,27,4,40],[47,27,47,28],[5,20,5,22],[5,27,5,28],[4,42,4,43],[4,44,4,46]]}
["Contabilità per centri di costo  - SOMED",null,null,null,null,null,null,null,null,null,null,null,null,null,null,null,null,null,null,null,null,null,null,"C O A N   - S O M E D ",null,null,null,null,null,null,null,null,null,null,null,null,null,null,null,null,null,null,null,null,null,null,"C O A N   - S O M E D "]
[{"$f":"Parametri!$B$7","v":2021},{"$f":"Parametri!$B$3","v":"ESEMPIO - CPA STANDARD CON CAT-STT"},null,null,null,null,null,null,null,null,null,null,null,null,null,null,null,null,null,null,null,null,null,{"$f":"+A2","v":2021},{"$f":"+B2","v":"ESEMPIO - CPA STANDARD CON CAT-STT"},null,null,null,null,null,null,null,null,null,null,null,null,null,null,null,null,null,null,null,null,null,{"$f":"+X2","v":2021},{"$f":"+Y2","v":"ESEMPIO - CPA STANDARD CON CAT-STT"}]
[]
[null,null,null,null,null,"                C o n t a b i l i t à    a n a l i t i c a     p e r    c e n t r i    d i    c o s t o                S O M E D "]
[null,null,null,null,null,"                C e n t r i    d i    c o s t o    g e n e r a l i",null,null,null,null,null,null,null,null,null,null,null,"                 Ce n t r i    d i    c o s t o    p r i n c i p a l i",null,null,null,null,null,null,null,null,null,"                S e r v i z i    a n n e s s i",null,null,null,null,null,null,null,null,null,null,null,null,null,null,"Voci non riconosciute\nSPOSTARE per SOMED",null,"Prestazioni all'atto\n-> SPOSTARE per SOMED-A",null,null,"G e s t i o n e    e s t r a n e a\nDELIMITATO per SOMED",null,null,null,null,null,null,null,null,null,null,"Gestione straordinaria\nDELIMITATO per SOMED",null,"CdC tecnico"]
[null,null,"COFI",null,"COAN","010","011","020","021","030","040","041","042","060","090","095","Totale ","100","110","115","130 - Terapie per SOMED-A",null,null,"140","150","151","Totale ","160 - CAT-STT",null,162,163,"16X",170,171,172,"17X",180,181,182,183,184,"Totale ",190,"Totale ",800,"80x","Totale ",900,905,910,915,920,925,930,935,940,945,"Totale ",990,"Totale ",999]
[null,"CDC per SOMED","Contabilità \nfinanziaria\n\nCosti","Delimitazioni\nper SOMED-A ","Contabilità analitica\nper SOMED-A\n\nCosti","Edifici\n\n ","Energia","Servizio tecnico","Servizio trasporti","Direzione/\nAmministrazione","Economia domestica in generale","Lavanderia","Pulizia","Cucina","Magazzino centrale","Farmacia",null,"Servizio alberghiero","Animazione\n(e cura NON LAMal)","Cura\n(LAMal)","130\nFisioterapia","131\nErgoterapia                  ","132\nAltre consulenze e terapie","Servizio medico                         ","Materiale\nsecondo EMAp","Medicamenti secondo\nES / EMT",null,"(160 CAT)","STT\n> NON COMPILARE !","Cure palliative\n\n> SPOSTARE per SOMED","Reparto Alzheimer\n\n> SPOSTARE per SOMED\n","STAZ n\n\n> SPOSTARE per SOMED","Ambulatorio medico\n\nDELIMITATO per SOMED","Centro diurno terapeutico (CDT)","Appartamenti protetti\n\nDELIMITATO per SOMED","AMB n (CD socio-ass ecc)\n\n> SPOSTARE per SOMED","Altre voci riconosciute\n(oneri ipotecari\ne affitti)\n> SPOSTARE per SOMED","Altre voci riconosciute (formaz. apprendisti, stag. e ausiliari)\n\n> SPOSTARE per SOMED-A","Altre voci riconosciute\n(neutraliz. cassa pensione)\n> SPOSTARE per SOMED-A","Altre voci riconosciute\n(contributi straordinari)\n> SPOSTARE per SOMED-A","Altre voci riconosciute\n(Spese COVID-19\nAnno 2021)\n> SPOSTARE per SOMED-A",null,"Voci\nnon riconosciute\n",null,"Gestione MEDICAMENTI\ne materiale all'atto","Gestione TERAPIE all'atto\n(fisio-, ergoterapia, altre terapie)\nn",null,"Appartamenti\nper il personale","Bar e ristorante","Edicola","Negozio","Parrucchiere","Pedicure","Posteggi","Prestazioni di lavanderia a terzi","Vendita di pasti\na terzi","ESTR n",null,"Gestione straordinaria",null,"Centro di costo tecnico",null,"somma"]
["Voci di costo ",null,"Costi","+/-","Costi ",null,null,null,null,null,null,null,null,null,null,null,null,null,null,null,null,null,null,null,null,null,null,null,null,null,null,null,null,null,null,null,null,null,null,null,null,null,null,null,null,null,null,null,null,null,null,null,null,null,null,null,null,null,null,null,null,null," di controllo"]
[3000,"Salari medici",170000,0,{"$f":"C9+D9","v":170000},null,null,null,null,null,null,null,null,null,null,null,{"$f":"SUM(F9:P9)","v":0},null,null,null,null,null,null,20000,null,null,{"$f":"SUM(R9:Z9)","v":20000},150000,null,null,null,null,0,null,0,null,null,null,null,null,null,{"$f":"SUM(AB9:AO9)","v":150000},null,{"$f":"SUM(AQ9)","v":0},null,null,{"$f":"SUM(AS9:AT9)","v":0},0,0,0,0,0,0,0,0,0,0,{"$f":"SUM(AV9:BE9)","v":0},0,{"$f":"SUM(BG9)","v":0},null,null,{"$f":"IF(ABS(E9-Q9-AA9-AP9-AR9-AU9-BF9-BH9)<0.0001,0,E9-Q9-AA9-AP9-AR9-AU9-BF9-BH9)","v":0}]
[3001,"Salari responsabili di struttura",111000,0,{"$f":"C10+D10","v":111000},null,null,null,null,10000,null,null,null,null,null,null,{"$f":"SUM(F10:P10)","v":10000},null,1000,100000,null,null,null,null,null,null,{"$f":"SUM(R10:Z10)","v":101000},null,null,null,null,null,0,null,0,null,null,null,null,null,null,{"$f":"SUM(AB10:AO10)","v":0},null,{"$f":"SUM(AQ10)","v":0},null,null,{"$f":"SUM(AS10:AT10)","v":0},0,0,0,0,0,0,0,0,0,0,0,0,{"$f":"SUM(BG10)","v":0},null,null,{"$f":"IF(ABS(E10-Q10-AA10-AP10-AR10-AU10-BF10-BH10)<0.0001,0,E10-Q10-AA10-AP10-AR10-AU10-BF10-BH10)","v":0}]
[3001.05,"Salari capi reparto",199900,0,{"$f":"C11+D11","v":199900},null,null,null,null,9000,null,null,null,null,null,null,9000,null,900,90000,null,null,null,null,null,null,{"$f":"SUM(R11:Z11)","v":90900},100000,null,null,null,null,0,null,0,null,null,null,null,null,null,100000,null,0,null,null,0,0,0,0,0,0,0,0,0,0,0,0,0,0,null,null,0]
[3001.1,"Salari infermieri e operatori socio sanitari (OSS)",1705600,0,{"$f":"C12+D12","v":1705600},null,null,null,null,11600,null,null,null,56000,null,null,67600,null,35000,{"$f":"1160000+18000","v":1178000},null,null,null,null,null,null,1213000,425000,null,null,null,null,0,null,0,null,null,null,null,null,{"$f":"18000-18000","v":0},{"$f":"SUM(AB12:AO12)","v":425000},null,0,null,null,{"$f":"SUM(AS12:AT12)","v":0},0,0,0,0,0,0,0,0,0,0,{"$f":"SUM(AV12:BE12)","v":0},0,0,null,null,0]
[3001.2,"Salari assistenti e ausiliari di cura",1905000,0,{"$f":"C13+D13","v":1905000},null,null,null,null,null,null,57500,57500,115000,null,null,230000,null,55000,{"$f":"1150000+40000","v":1190000},null,null,null,null,null,null,1245000,430000,null,null,null,null,0,null,0,null,null,null,null,null,{"$f":"40000-40000","v":0},430000,null,0,null,null,0,0,0,0,0,0,0,0,0,0,0,0,0,0,null,null,0]
[3001.3,"Salari dietisti",44000,0,{"$f":"C14+D14","v":44000},null,null,null,null,4000,null,null,null,null,null,null,{"$f":"SUM(F14:P14)","v":4000},null,null,null,null,null,40000,null,null,null,{"$f":"SUM(R14:Z14)","v":40000},null,null,null,null,null,0,null,0,null,null,null,null,null,null,{"$f":"SUM(AB14:AO14)","v":0},null,{"$f":"SUM(AQ14)","v":0},null,null,{"$f":"SUM(AS14:AT14)","v":0},0,0,0,0,0,0,0,0,0,0,{"$f":"SUM(AV14:BE14)","v":0},0,{"$f":"SUM(BG14)","v":0},null,null,{"$f":"IF(ABS(E14-Q14-AA14-AP14-AR14-AU14-BF14-BH14)<0.0001,0,E14-Q14-AA14-AP14-AR14-AU14-BF14-BH14)","v":0}]
[3001.9,"Salari personale di cura in formazione e stagisti",35500,0,{"$f":"C15+D15","v":35500},null,null,null,null,null,null,null,null,null,null,null,0,null,null,{"$f":"35000+500","v":35500},null,null,null,null,null,null,35500,null,null,null,null,null,0,null,0,null,null,{"$f":"35000-35000","v":0},null,null,{"$f":"500-500","v":0},0,null,0,null,null,0,0,0,0,0,0,0,0,0,0,0,0,0,0,null,null,0]
[3002,"Salari personale altre discipline mediche specializzate",329000,0,329000,null,null,null,null,3500,null,null,null,null,null,10000,13500,null,125000,null,{"$f":"10000+15000","v":25000},{"$f":"20000+500+25000","v":45500},null,null,null,null,195500,120000,null,null,null,null,0,null,0,null,null,null,null,null,{"$f":"500-500","v":0},120000,null,0,{"$f":"10000-10000","v":0},{"$f":"40000-40000","v":0},0,0,0,0,0,0,0,0,0,0,0,0,0,0,null,null,0]
[3003,"Salari personale amministrativo",261500,0,261500,null,null,null,null,{"$f":"238000+12000+11500","v":261500},null,null,null,null,null,null,261500,null,null,null,null,null,null,null,null,null,0,null,null,null,null,null,0,null,0,null,null,{"$f":"12000-12000","v":0},null,null,{"$f":"11500-11500","v":0},0,null,0,null,null,0,0,0,0,0,0,0,0,0,0,0,0,0,0,null,null,0]
[3004,"Salari personale servizio alberghiero",945000,0,945000,null,null,null,null,null,55000,{"$f":"215000+10000","v":225000},{"$f":"200000+15000","v":215000},450000,null,null,945000,null,null,null,null,null,null,null,null,null,0,null,null,null,null,null,0,null,0,null,null,null,null,null,{"$f":"25000-25000","v":0},0,null,0,null,null,0,0,0,0,0,0,0,0,0,0,0,0,0,0,null,null,0]
[3005,"Salari personale servizio tecnico",76000,0,76000,null,null,{"$f":"69000+6000+1000","v":76000},null,null,null,null,null,null,null,null,76000,null,null,null,null,null,null,null,null,null,0,null,null,null,null,null,0,null,0,null,null,{"$f":"6000-6000","v":0},null,null,{"$f":"1000-1000","v":0},0,null,0,null,null,0,0,0,0,0,0,0,0,0,0,0,0,0,0,null,null,0]
[3009,"Prestazioni continuative da parte di personale esterno ",50000,0,50000,null,null,null,null,null,null,null,null,null,null,null,0,null,null,50000,null,null,null,null,null,null,50000,null,null,null,null,null,0,null,0,null,null,null,null,null,null,0,null,0,null,null,0,0,0,0,0,0,0,0,0,0,0,0,0,0,null,null,{"$f":"IF(ABS(E20-Q20-AA20-AP20-AR20-AU20-BF20-BH20)<0.0001,0,E20-Q20-AA20-AP20-AR20-AU20-BF20-BH20)","v":0}]
[309,"Messa a disposizione di personale a terzi ",0,0,0,null,null,null,null,null,null,null,null,null,null,null,0,null,null,null,null,null,null,null,null,null,0,null,null,null,null,null,0,null,0,null,null,null,null,null,null,0,null,0,null,null,0,0,0,0,0,0,0,0,0,0,0,0,0,0,null,null,0]
[37,"Oneri sociali",1340000,{"$f":"-SUM('Contabilità per CDC - UACD'!AG22,'Contabilità per CDC - UACD'!AI22,'Contabilità per CDC - UACD'!AS22:AT22,'Contabilità per CDC - UACD'!AV22:BE22,'Contabilità per CDC - UACD'!BG22)","v":-11586.683960224816},1328413.3160397753,{"$f":"IF(SUM($E9:$E19)=0,0,SUM(F9:F19)/SUM($E9:$E19)*$E22)","v":0},{"$f":"IF(SUM($E9:$E19)=0,0,SUM(G9:G19)/SUM($E9:$E19)*$E22)","v":0},17459.474624993156,0,68827.08681115722,12635.146110192414,64898.705020533765,62601.405727771511,142662.28608053617,0,{"$f":"IF(SUM($E9:$E19)=0,0,SUM(P9:P19)/SUM($E9:$E19)*$E22)","v":2297.2992927622572},{"$f":"SUM(F22:P22)","v":371381.40366794646},{"$f":"IF(SUM($E9:$E19)=0,0,SUM(R9:R19)/SUM($E9:$E19)*$E22)","v":0},{"$f":"IF(SUM($E9:$E19)=0,0,SUM(S9:S19)/SUM($E9:$E19)*$E22)","v":49828.421660013359},595804.57157789147,5743.2482319056435,10452.711782068271,9189.1971710490288,4594.5985855245144,0,0,675612.74900845229,{"$f":"IF(SUM($E9:$E19)=0,0,SUM(AB9:AB19)/SUM($E9:$E19)*$E22)","v":281419.16336337652},null,{"$f":"IF(SUM($E9:$E19)=0,0,SUM(AD9:AD19)/SUM($E9:$E19)*$E22)","v":0},0,0,0,0,0,0,0,0,0,0,{"$f":"IF(SUM($E9:$E19)=0,0,SUM(AO9:AO19)/SUM($E9:$E19)*$E22)","v":0},281419.16336337652,{"$f":"IF(SUM($E9:$E19)=0,0,SUM(AQ9:AQ19)/SUM($E9:$E19)*$E22)","v":0},0,{"$f":"IF(SUM($E9:$E19)=0,0,SUM(AS9:AS19)/SUM($E9:$E19)*$E22)","v":0},0,0,{"$f":"IF(SUM($E9:$E19)=0,0,SUM(AV9:AV19)/SUM($E9:$E19)*$E22)","v":0},{"$f":"IF(SUM($E9:$E19)=0,0,SUM(AW9:AW19)/SUM($E9:$E19)*$E22)","v":0},0,0,0,0,0,0,0,0,{"$f":"SUM(AV22:BE22)","v":0},0,0,null,null,0]
[null,"Neutraliz. cassa pensione - tralasciato per SOMED "]
[38,"Onorari medici",25000,0,25000,null,null,null,null,null,null,null,null,null,null,null,{"$f":"SUM(F24:P24)","v":0},null,null,{"$f":"10000+15000","v":25000},null,null,null,null,null,null,25000,null,null,null,null,null,0,null,0,null,null,null,null,null,{"$f":"15000-15000","v":0},0,null,0,null,null,{"$f":"SUM(AS24:AT24)","v":0},0,0,0,0,0,0,0,0,0,0,0,0,0,null,null,0]
[39,"Altri costi del personale",38000,0,38000,null,null,500,null,{"$f":"1000+1000","v":2000},null,null,null,null,null,null,{"$f":"SUM(F25:P25)","v":2500},null,500,{"$f":"15000+19000","v":34000},500,500,null,null,null,null,35500,null,null,null,null,null,0,null,0,null,null,null,null,null,{"$f":"20000-20000","v":0},0,null,0,null,null,0,0,0,0,0,0,0,0,0,0,0,0,0,0,null,null,0]
[40,"Fabbisogno medico",170100,0,170100,null,null,null,null,null,null,null,null,null,null,{"$f":"5000+5000","v":10000},10000,null,null,null,null,null,null,100,60000,{"$f":"15000+60000","v":75000},135100,25000,null,null,null,null,0,null,0,null,null,null,null,null,{"$f":"5000-5000","v":0},25000,null,0,{"$f":"60000-60000","v":0},null,0,0,0,0,0,0,0,0,0,0,0,0,0,0,null,null,0]
[41,"Costi dei generi alimentari",250000,0,250000,null,null,null,null,null,null,null,null,250000,null,null,250000,null,null,null,null,null,null,null,null,null,0,null,null,null,null,null,0,null,0,null,null,null,null,null,null,0,null,0,null,null,0,0,0,0,0,0,0,0,0,0,0,0,0,0,null,null,0]
[42,"Costi di economia domestica",126200,0,126200,null,null,1200,null,null,5000,{"$f":"15000+10000","v":25000},{"$f":"30000+10000","v":40000},25000,null,null,96200,25000,500,3000,250,250,null,null,null,null,29000,1000,null,null,null,null,0,null,0,null,null,null,null,null,{"$f":"20000-20000","v":0},1000,null,0,null,null,0,0,0,0,0,0,0,0,0,0,0,0,0,0,null,null,0]
[43,"Manutenzione e riparazione",153049.99999999997,-150,152899.99999999997,{"$f":"80000+11000","v":91000},3000,3000,8000,18000,2000,4000,500,13000,null,null,142500,2000,100,8000,150,150,null,null,null,null,10400,null,null,null,null,null,0,null,0,null,null,null,null,null,{"$f":"11000-11000","v":0},0,null,0,null,null,0,0,0,0,0,0,0,0,0,0,0,0,0,0,null,null,0]
[440,"Investimenti inferiori al limite di attivazione COAN",59500,0,59500,{"$f":"8500+10000","v":18500},null,{"$f":"5000","v":5000},null,10000,null,500,900,9000,null,null,{"$f":"SUM(F30:P30)","v":43900},5000,100,9500,500,500,null,null,null,null,15600,null,null,null,null,null,0,null,0,null,null,null,null,null,{"$f":"15000-15000","v":0},0,null,0,null,null,0,0,0,0,0,0,0,0,0,0,0,0,0,0,null,null,0]
[442,"Ammortamenti",{"$f":"'Resoconti COIN'!H131","v":822589},null,822589,{"$f":"'Resoconti COIN'!H109-SUM(AB31:AC31,AH31)","v":681818},{"$f":"'Resoconti COIN'!H110","v":4500},{"$f":"'Resoconti COIN'!H111","v":6000},{"$f":"'Resoconti COIN'!H112","v":8000},{"$f":"'Resoconti COIN'!H113","v":86417},{"$f":"'Resoconti COIN'!H114","v":0},{"$f":"'Resoconti COIN'!H115","v":3300},{"$f":"'Resoconti COIN'!H116","v":1100},{"$f":"'Resoconti COIN'!H117","v":3800},{"$f":"'Resoconti COIN'!H118","v":0},{"$f":"'Resoconti COIN'!H119","v":1200},796135,{"$f":"'Resoconti COIN'!H122","v":15208},{"$f":"'Resoconti COIN'!H123","v":2121},{"$f":"'Resoconti COIN'!H124","v":8750},{"$f":"'Resoconti COIN'!H125","v":375},null,null,{"$f":"'Resoconti COIN'!H126","v":0},{"$f":"'Resoconti COIN'!H127","v":0},{"$f":"'Resoconti COIN'!H128","v":0},26454,null,null,null,null,null,null,null,null,null,null,null,null,null,null,null,null,null,null,null,null,null,null,null,null,null,null,null,null,null,null,null,null,null,null,null,{"$f":"IF(ABS(E31-Q31-AA31-AP31-AR31-AU31-BF31-BH31)<0.0001,0,E31-Q31-AA31-AP31-AR31-AU31-BF31-BH31)","v":0}]
[443,"Canoni locaz. x immob < limite di attivaz - tralasciato per SOMED",null,null,0,null,null,null,null,null,null,null,null,null,null,null,0,null,null,null,null,null,null,null,null,null,null,null,null,null,null,null,null,null,null,null,null,null,null,null,null,null,null,null,null,null,null,null,null,null,null,null,null,null,null,null,null,null,null,null,null,null,0]
[444,"Canoni locaz. x immob. =o> limite di attivaz - tralasciato per SOMED",1000,{"$f":"-C33","v":-1000},0,null,null,null,null,null,null,null,null,null,null,null,0,null,null,null,null,null,null,null,null,null,null,null,null,null,null,null,null,null,null,null,null,null,null,null,null,null,null,null,null,null,null,null,null,null,null,null,null,null,null,null,null,null,null,null,null,null,0]
[448,"Interessi calcolatori sull'attivo fisso",{"$f":"'Resoconti COIN'!K131","v":580097},null,580097,{"$f":"'Resoconti COIN'!K109-SUM(AB34:AC34,AH34)","v":566100},{"$f":"'Resoconti COIN'!K110","v":1665},{"$f":"'Resoconti COIN'!K111","v":2220},{"$f":"'Resoconti COIN'!K112","v":740},{"$f":"'Resoconti COIN'!K113","v":3083},{"$f":"'Resoconti COIN'!K114","v":0},{"$f":"'Resoconti COIN'!K115","v":611},{"$f":"'Resoconti COIN'!K116","v":102},{"$f":"'Resoconti COIN'!K117","v":703},{"$f":"'Resoconti COIN'!K118","v":0},{"$f":"'Resoconti COIN'!K119","v":222},575446,{"$f":"'Resoconti COIN'!K122","v":2652},{"$f":"'Resoconti COIN'!K123","v":1295},{"$f":"'Resoconti COIN'!K124","v":648},{"$f":"'Resoconti COIN'!K125","v":56},null,null,{"$f":"'Resoconti COIN'!K126","v":0},{"$f":"'Resoconti COIN'!K127","v":0},{"$f":"'Resoconti COIN'!K128","v":0},4651,null,null,null,null,null,null,null,null,null,null,null,null,null,null,null,null,null,null,null,null,null,null,null,null,null,null,null,null,null,null,null,null,null,null,null,{"$f":"IF(ABS(E34-Q34-AA34-AP34-AR34-AU34-BF34-BH34)<0.0001,0,E34-Q34-AA34-AP34-AR34-AU34-BF34-BH34)","v":0}]
[45,"Costi per energia e acqua",116300,0,116300,null,115000,null,null,null,null,null,null,1300,null,null,116300,null,null,null,null,null,null,null,null,null,{"$f":"SUM(R35:Z35)","v":0},null,null,null,null,null,0,null,0,null,null,null,null,null,null,{"$f":"SUM(AB35:AO35)","v":0},null,{"$f":"SUM(AQ35)","v":0},null,null,{"$f":"SUM(AS35:AT35)","v":0},0,0,0,0,0,0,0,0,0,0,0,0,0,null,null,0]
[46,"Oneri finanziari",551111.92000000004,-549246.92000000004,1865,null,null,null,null,1865,null,null,null,null,null,null,1865,null,null,null,null,null,null,null,null,null,{"$f":"SUM(R36:Z36)","v":0},null,null,null,null,null,0,null,0,null,null,null,null,null,null,{"$f":"SUM(AB36:AO36)","v":0},null,{"$f":"SUM(AQ36)","v":0},null,null,{"$f":"SUM(AS36:AT36)","v":0},0,0,0,0,0,0,0,0,0,0,0,0,0,null,null,0]
[47,"Costi amministrativi e di informatica",66500,0,66500,null,null,null,null,{"$f":"65000+500","v":65500},null,null,null,null,null,null,65500,null,null,500,250,250,null,null,null,null,{"$f":"SUM(R37:Z37)","v":1000},null,null,null,null,null,0,null,0,null,null,null,null,null,{"$f":"500-500","v":0},{"$f":"SUM(AB37:AO37)","v":0},null,{"$f":"SUM(AQ37)","v":0},null,null,{"$f":"SUM(AS37:AT37)","v":0},0,0,0,0,0,0,0,0,0,0,0,0,0,null,null,0]
[48,"Altri costi relativi ai residenti",10100,0,10100,null,null,null,null,{"$f":"1500+600","v":2100},null,null,null,null,null,null,2100,{"$f":"5900+600","v":6500},1500,null,null,null,null,null,null,null,{"$f":"SUM(R38:Z38)","v":8000},null,null,null,null,null,0,null,0,null,null,null,null,null,{"$f":"1200-1200","v":0},{"$f":"SUM(AB38:AO38)","v":0},null,{"$f":"SUM(AQ38)","v":0},null,null,{"$f":"SUM(AS38:AT38)","v":0},0,0,0,0,0,0,0,0,0,0,0,0,0,null,null,0]
[49,"Altri costi non relativi ai residenti",52500,0,52500,20000,null,null,null,{"$f":"10000+10000","v":20000},null,500,null,1500,null,null,42000,null,4500,{"$f":"500+5000","v":5500},300,200,null,null,null,null,{"$f":"SUM(R39:Z39)","v":10500},null,null,null,null,null,0,null,0,null,null,null,null,null,{"$f":"15000-15000","v":0},{"$f":"SUM(AB39:AO39)","v":0},null,{"$f":"SUM(AQ39)","v":0},null,null,{"$f":"SUM(AS39:AT39)","v":0},0,0,0,0,0,0,0,0,0,0,0,0,0,null,null,0]
[null,"Costi lordi prima delle ripartizioni",{"$f":"SUM(C9:C39)","v":10194547.92},{"$f":"SUM(D9:D39)","v":-561983.60396022489},9632564.3160397746,1377418,124165,111379.47462499316,16740,{"$f":"SUM(J9:J39)","v":577392.08681115718},74635.146110192407,381309.70502053376,377703.40572777152,1067965.2860805362,0,23719.299292762258,4132427.4036679463,56360,277344.42166001338,3334202.5715778917,33124.248231905643,57802.711782068269,49189.197171049032,24694.598585524516,60000,75000,3967717.7490084525,1532419.1633633766,null,0,0,0,0,0,{"$f":"SUM(AI9:AI39)","v":0},0,0,0,0,0,0,1532419.1633633766,0,0,0,0,0,0,0,0,0,0,0,0,0,0,0,0,0,0,null,null,0]
["Riduzione dei costi, ricavi accessori compresi",null,null,null," ",null," "]
[65,"Altri ricavi da prestazioni ai residenti",-23360,5000,{"$f":"C42+D42","v":-18360},null,null,null,-5000,-8000,null,-300,null,-250,null,-10,{"$f":"SUM(F42:P42)","v":-13560},-800,-4000,0,0,0,0,0,0,0,{"$f":"SUM(R42:Z42)","v":-4800},null,null,null,null,null,0,null,0,null,null,null,null,null,null,{"$f":"SUM(AB42:AO42)","v":0},null,{"$f":"SUM(AQ42)","v":0},null,null,{"$f":"SUM(AS42:AT42)","v":0},0,0,0,0,0,0,0,0,0,0,{"$f":"SUM(AV42:BE42)","v":0},0,{"$f":"SUM(BG42)","v":0},null,null,{"$f":"IF(ABS(E42-Q42-AA42-AP42-AR42-AU42-BF42-BH42)<0.0001,0,E42-Q42-AA42-AP42-AR42-AU42-BF42-BH42)","v":0}]
[66,"Ricavi finanziari - tralasciato per SOMED",null,null,null,null,null,null,null,null,null,null,null,null,null,null,null,null,null,null,null,null,null,null,null,null,null,null,null,null,null,null,null,null,null,null,null,null,null,null,null,null,null,null,null,null,null,null,null,null,null,null,null,null,null,null,null,null,null,null,null,null,{"$f":"IF(ABS(E43-Q43-AA43-AP43-AR43-AU43-BF43-BH43)<0.0001,0,E43-Q43-AA43-AP43-AR43-AU43-BF43-BH43)","v":0}]
[68,"Ricavi da prestazioni fornite al personale e a terzi",-28550,28000,{"$f":"C44+D44","v":-550},null,null,null,null,-100,null,-150,null,-300,null,null,{"$f":"SUM(F44:P44)","v":-550},null,null,null,null,null,null,null,null,null,{"$f":"SUM(R44:Z44)","v":0},null,null,null,null,null,0,null,0,null,null,null,null,null,null,{"$f":"SUM(AB44:AO44)","v":0},null,{"$f":"SUM(AQ44)","v":0},null,null,{"$f":"SUM(AS44:AT44)","v":0},0,0,0,0,0,0,0,0,0,0,{"$f":"SUM(AV44:BE44)","v":0},0,{"$f":"SUM(BG44)","v":0},null,null,{"$f":"IF(ABS(E44-Q44-AA44-AP44-AR44-AU44-BF44-BH44)<0.0001,0,E44-Q44-AA44-AP44-AR44-AU44-BF44-BH44)","v":0}]
["EX 7","Riduzione costi dei CdC generali imputati su CdC non SOMED",null,null,{"$f":"Q45","v":-65390.488412276434},{"$f":"-(SUM('Contabilità per CDC - UACD'!AG48,'Contabilità per CDC - UACD'!AI48,'Contabilità per CDC - UACD'!AV48:BE48,'Contabilità per CDC - UACD'!BG48))","v":-3545.751633986928},{"$f":"-(SUM('Contabilità per CDC - UACD'!AG49,'Contabilità per CDC - UACD'!AI49,'Contabilità per CDC - UACD'!AV49:BE49,'Contabilità per CDC - UACD'!BG49))","v":-4255.1557966963837},{"$f":"-(SUM('Contabilità per CDC - UACD'!AG50,'Contabilità per CDC - UACD'!AI50,'Contabilità per CDC - UACD'!AV50:BE50,'Contabilità per CDC - UACD'!BG50))","v":-3495.5734378081393},{"$f":"-(SUM('Contabilità per CDC - UACD'!AG51,'Contabilità per CDC - UACD'!AI51,'Contabilità per CDC - UACD'!AV51:BE51,'Contabilità per CDC - UACD'!BG51))","v":0},{"$f":"-(SUM('Contabilità per CDC - UACD'!AG52,'Contabilità per CDC - UACD'!AI52,'Contabilità per CDC - UACD'!AV52:BE52,'Contabilità per CDC - UACD'!BG52))","v":0},{"$f":"-(SUM('Contabilità per CDC - UACD'!AG53,'Contabilità per CDC - UACD'!AI53,'Contabilità per CDC - UACD'!AV53:BE53,'Contabilità per CDC - UACD'!BG53))","v":0},{"$f":"-(SUM('Contabilità per CDC - UACD'!AG54,'Contabilità per CDC - UACD'!AI54,'Contabilità per CDC - UACD'!AV54:BE54,'Contabilità per CDC - UACD'!BG54))","v":0},{"$f":"-(SUM('Contabilità per CDC - UACD'!AG55,'Contabilità per CDC - UACD'!AI55,'Contabilità per CDC - UACD'!AV55:BE55,'Contabilità per CDC - UACD'!BG55))","v":-13119.053889327255},{"$f":"-(SUM('Contabilità per CDC - UACD'!AG56,'Contabilità per CDC - UACD'!AI56,'Contabilità per CDC - UACD'!AV56:BE56,'Contabilità per CDC - UACD'!BG56))","v":-40974.953654457728},{"$f":"-(SUM('Contabilità per CDC - UACD'!AG57,'Contabilità per CDC - UACD'!AI57,'Contabilità per CDC - UACD'!AV57:BE57,'Contabilità per CDC - UACD'!BG57))","v":0},{"$f":"-(SUM('Contabilità per CDC - UACD'!AG58,'Contabilità per CDC - UACD'!AI58,'Contabilità per CDC - UACD'!AV58:BE58,'Contabilità per CDC - UACD'!BG58))","v":0},{"$f":"SUM(F45:P45)","v":-65390.488412276434},null,null,null,null,null,null,null,null,null,null,null,null,null,null,null,null,null,null,null,null,null,null,null,null,null,null,null,null,null,null,null,null,null,null,null,null,null,null,null,null,null,null,null,null,null,{"$f":"IF(ABS(E45-Q45-AA45-AP45-AR45-AU45-BF45-BH45)<0.0001,0,E45-Q45-AA45-AP45-AR45-AU45-BF45-BH45)","v":0}]
[null,"Costi netti prima delle ripartizioni ",{"$f":"SUM(C40:C45)","v":10142637.92},-528983.60396022489,9548263.8276274987,1373872.2483660132,119909.84420330361,107883.90118718502,11740,569292.08681115718,74635.146110192407,380859.70502053376,364584.35183844424,1026440.3324260785,0,23709.299292762258,{"$f":"SUM(Q40:Q45)","v":4052926.91525567},55560,273344.42166001338,3334202.5715778917,33124.248231905643,57802.711782068269,49189.197171049032,24694.598585524516,60000,{"$f":"SUM(Z40:Z45)","v":75000},3962917.7490084525,1532419.1633633766,null,0,0,0,0,0,0,0,0,0,0,0,0,1532419.1633633766,0,0,0,0,0,0,0,0,0,0,0,0,0,0,0,0,0,0,null,null,{"$f":"IF(ABS(E46-Q46-AA46-AP46-AR46-AU46-BF46-BH46)<0.0001,0,E46-Q46-AA46-AP46-AR46-AU46-BF46-BH46)","v":0}]
["Ripartizioni costi sui CdC",null,"Unità","Totale","Prezzo/unità"]
["RIP010","Ripartizione Edifici",{"$f":"Ripartizioni!C32","v":"m2"},{"$f":"Ripartizioni!E76","v":4440},{"$f":"Ripartizioni!E91","v":309.43068656892189},{"$f":"-SUM(F46,F49:F58)","v":-1373872.2483660132},{"$f":"Ripartizioni!$E91*Ripartizioni!G76","v":23207.301492669143},{"$f":"Ripartizioni!$E91*Ripartizioni!H76","v":15471.534328446094},{"$f":"Ripartizioni!$E91*Ripartizioni!I76","v":0},{"$f":"Ripartizioni!$E91*Ripartizioni!J76","v":30943.068656892188},{"$f":"Ripartizioni!$E91*Ripartizioni!K76","v":24754.45492551375},{"$f":"Ripartizioni!$E91*Ripartizioni!L76","v":30943.068656892188},{"$f":"Ripartizioni!$E91*Ripartizioni!M76","v":13924.380895601485},{"$f":"Ripartizioni!$E91*Ripartizioni!N76","v":99017.819702055},{"$f":"Ripartizioni!$E91*Ripartizioni!O76","v":0},{"$f":"Ripartizioni!$E91*Ripartizioni!P76","v":0},{"$f":"SUM(F48:P48)","v":-1135610.6197079429},{"$f":"Ripartizioni!$E91*Ripartizioni!Q76","v":773576.71642230474},{"$f":"Ripartizioni!$E91*Ripartizioni!R76","v":37131.682388270623},{"$f":"Ripartizioni!$E91*Ripartizioni!S76","v":30943.068656892188},{"$f":"Ripartizioni!$E91*Ripartizioni!T76","v":13150.80417917918},{"$f":"Ripartizioni!$E91*Ripartizioni!U76","v":14697.957612023789},{"$f":"Ripartizioni!$E91*Ripartizioni!V76","v":0},{"$f":"Ripartizioni!$E91*Ripartizioni!W76","v":0},{"$f":"Ripartizioni!$E91*Ripartizioni!X76","v":0},{"$f":"Ripartizioni!$E91*Ripartizioni!Y76","v":3094.3068656892187},{"$f":"SUM(R48:Z48)","v":872594.5361243597},{"$f":"Ripartizioni!$E91*Ripartizioni!Z76","v":263016.08358358359},null,null,null,null,null,{"$f":"Ripartizioni!$E91*Ripartizioni!AF76","v":0},null,null,null,null,null,null,null,{"$f":"SUM(AB48:AO48)","v":263016.08358358359},null,null,null,null,null,null,null,null,null,null,null,null,null,null,null,null,null,null,null,null,{"$f":"IF(ABS(Q48+AA48+AP48+AR48+AU48+BF48+BH48)<0.0001,0,Q48+AA48+AP48+AR48+AU48+BF48+BH48)","v":0}]
["RIP011","Ripartizione Energia",{"$f":"Ripartizioni!C33","v":"m2"},{"$f":"Ripartizioni!E77","v":4365},{"$f":"Ripartizioni!E92","v":35.072991049573197},{"$f":"Ripartizioni!$E92*Ripartizioni!F77","v":0},{"$f":"-SUM(G46,G48,G50:G58)","v":-153093.60593138702},{"$f":"Ripartizioni!$E92*Ripartizioni!H77","v":1753.6495524786599},{"$f":"Ripartizioni!$E92*Ripartizioni!I77","v":0},{"$f":"Ripartizioni!$E92*Ripartizioni!J77","v":3507.2991049573197},{"$f":"Ripartizioni!$E92*Ripartizioni!K77","v":2805.8392839658559},{"$f":"Ripartizioni!$E92*Ripartizioni!L77","v":3507.2991049573197},{"$f":"Ripartizioni!$E92*Ripartizioni!M77","v":1578.2845972307939},{"$f":"Ripartizioni!$E92*Ripartizioni!N77","v":11223.357135863424},{"$f":"Ripartizioni!$E92*Ripartizioni!O77","v":0},{"$f":"Ripartizioni!$E92*Ripartizioni!P77","v":0},-128717.87715193367,{"$f":"Ripartizioni!$E92*Ripartizioni!Q77","v":87682.477623932995},{"$f":"Ripartizioni!$E92*Ripartizioni!R77","v":4208.7589259487841},{"$f":"Ripartizioni!$E92*Ripartizioni!S77","v":3507.2991049573197},{"$f":"Ripartizioni!$E92*Ripartizioni!T77","v":1490.6021196068609},{"$f":"Ripartizioni!$E92*Ripartizioni!U77","v":1665.9670748547269},{"$f":"Ripartizioni!$E92*Ripartizioni!V77","v":0},{"$f":"Ripartizioni!$E92*Ripartizioni!W77","v":0},{"$f":"Ripartizioni!$E92*Ripartizioni!X77","v":0},{"$f":"Ripartizioni!$E92*Ripartizioni!Y77","v":350.72991049573199},98905.834759796417,{"$f":"Ripartizioni!$E92*Ripartizioni!Z77","v":29812.042392137217},null,null,null,null,null,{"$f":"Ripartizioni!$E92*Ripartizioni!AF77","v":0},null,null,null,null,null,null,null,29812.042392137217,null,null,null,null,null,null,null,null,null,null,null,null,null,null,null,null,null,null,null,null,{"$f":"IF(ABS(Q49+AA49+AP49+AR49+AU49+BF49+BH49)<0.0001,0,Q49+AA49+AP49+AR49+AU49+BF49+BH49)","v":0}]
["RIP020","Ripartizione Servizi tecnici",{"$f":"Ripartizioni!C34","v":"m2"},{"$f":"Ripartizioni!E78","v":4390},{"$f":"Ripartizioni!E93","v":32.651078827280628},{"$f":"Ripartizioni!$E93*Ripartizioni!F78","v":0},{"$f":"Ripartizioni!$E93*Ripartizioni!G78","v":2448.8309120460472},{"$f":"-SUM(H46,H48:H49,H51:H58)","v":-143338.23605176195},{"$f":"Ripartizioni!$E93*Ripartizioni!I78","v":0},{"$f":"Ripartizioni!$E93*Ripartizioni!J78","v":3265.1078827280626},{"$f":"Ripartizioni!$E93*Ripartizioni!K78","v":2612.0863061824502},{"$f":"Ripartizioni!$E93*Ripartizioni!L78","v":3265.1078827280626},{"$f":"Ripartizioni!$E93*Ripartizioni!M78","v":1469.2985472276282},{"$f":"Ripartizioni!$E93*Ripartizioni!N78","v":10448.345224729801},{"$f":"Ripartizioni!$E93*Ripartizioni!O78","v":0},{"$f":"Ripartizioni!$E93*Ripartizioni!P78","v":0},-119829.45929611987,{"$f":"Ripartizioni!$E93*Ripartizioni!Q78","v":81627.697068201567},{"$f":"Ripartizioni!$E93*Ripartizioni!R78","v":3918.1294592736754},{"$f":"Ripartizioni!$E93*Ripartizioni!S78","v":3265.1078827280626},{"$f":"Ripartizioni!$E93*Ripartizioni!T78","v":1387.6708501594267},{"$f":"Ripartizioni!$E93*Ripartizioni!U78","v":1550.9262442958297},{"$f":"Ripartizioni!$E93*Ripartizioni!V78","v":0},{"$f":"Ripartizioni!$E93*Ripartizioni!W78","v":0},{"$f":"Ripartizioni!$E93*Ripartizioni!X78","v":0},{"$f":"Ripartizioni!$E93*Ripartizioni!Y78","v":326.51078827280628},92076.042292931364,{"$f":"Ripartizioni!$E93*Ripartizioni!Z78","v":27753.417003188533},null,null,null,null,null,{"$f":"Ripartizioni!$E93*Ripartizioni!AF78","v":0},null,null,null,null,null,null,null,27753.417003188533,null,null,null,null,null,null,null,null,null,null,null,null,null,null,null,null,null,null,null,null,0]
["RIP021","Ripartizione Servizio trasporti",{"$f":"Ripartizioni!C35","v":"km (sistematico)"},{"$f":"Ripartizioni!E79","v":1900},{"$f":"Ripartizioni!E94","v":6.1789473684210527},{"$f":"Ripartizioni!$E94*Ripartizioni!F79","v":0},{"$f":"Ripartizioni!$E94*Ripartizioni!G79","v":0},{"$f":"Ripartizioni!$E94*Ripartizioni!H79","v":617.89473684210532},{"$f":"-SUM(I46,I48:I50,I52:I58)","v":-11740},{"$f":"Ripartizioni!$E94*Ripartizioni!J79","v":6796.8421052631584},{"$f":"Ripartizioni!$E94*Ripartizioni!K79","v":0},{"$f":"Ripartizioni!$E94*Ripartizioni!L79","v":0},{"$f":"Ripartizioni!$E94*Ripartizioni!M79","v":0},{"$f":"Ripartizioni!$E94*Ripartizioni!N79","v":308.94736842105266},{"$f":"Ripartizioni!$E94*Ripartizioni!O79","v":0},{"$f":"Ripartizioni!$E94*Ripartizioni!P79","v":0},-4016.3157894736842,{"$f":"Ripartizioni!$E94*Ripartizioni!Q79","v":0},{"$f":"Ripartizioni!$E94*Ripartizioni!R79","v":926.84210526315792},{"$f":"Ripartizioni!$E94*Ripartizioni!S79","v":3089.4736842105262},{"$f":"Ripartizioni!$E94*Ripartizioni!T79","v":0},{"$f":"Ripartizioni!$E94*Ripartizioni!U79","v":0},{"$f":"Ripartizioni!$E94*Ripartizioni!V79","v":0},{"$f":"Ripartizioni!$E94*Ripartizioni!W79","v":0},{"$f":"Ripartizioni!$E94*Ripartizioni!X79","v":0},{"$f":"Ripartizioni!$E94*Ripartizioni!Y79","v":0},4016.3157894736842,{"$f":"Ripartizioni!$E94*Ripartizioni!Z79","v":0},null,null,null,null,null,{"$f":"Ripartizioni!$E94*Ripartizioni!AF79","v":0},null,null,null,null,null,null,null,0,null,null,null,null,null,null,null,null,null,null,null,null,null,null,null,null,null,null,null,null,0]
["RIP030","Ripartizione Direzione / Amministrazione",{"$f":"Ripartizioni!C36","v":"% retribuzione"},{"$f":"Ripartizioni!E80","v":0.94818849978383046},{"$f":"Ripartizioni!E95","v":664627.16183446976},{"$f":"Ripartizioni!$E95*Ripartizioni!F80","v":0},{"$f":"Ripartizioni!$E95*Ripartizioni!G80","v":0},{"$f":"Ripartizioni!$E95*Ripartizioni!H80","v":8735.2640379454733},{"$f":"Ripartizioni!$E95*Ripartizioni!I80","v":0},{"$f":"-SUM(J46,J48:J51,J53:J58)","v":-630191.831495411},{"$f":"Ripartizioni!$E95*Ripartizioni!K80","v":6321.572659039487},{"$f":"Ripartizioni!$E95*Ripartizioni!L80","v":32469.895930521005},{"$f":"Ripartizioni!$E95*Ripartizioni!M80","v":31320.519083422914},{"$f":"Ripartizioni!$E95*Ripartizioni!N80","v":71376.302204791296},{"$f":"Ripartizioni!$E95*Ripartizioni!O80","v":0},{"$f":"Ripartizioni!$E95*Ripartizioni!P80","v":1149.3768470980885},-478818.90073259274,{"$f":"Ripartizioni!$E95*Ripartizioni!Q80","v":0},{"$f":"Ripartizioni!$E95*Ripartizioni!R80","v":24929.983813557541},{"$f":"Ripartizioni!$E95*Ripartizioni!S80","v":298090.88529488927},{"$f":"Ripartizioni!$E95*Ripartizioni!T80","v":2873.4421177452218},{"$f":"Ripartizioni!$E95*Ripartizioni!U80","v":5229.6646542963035},{"$f":"Ripartizioni!$E95*Ripartizioni!V80","v":4597.5073883923542},{"$f":"Ripartizioni!$E95*Ripartizioni!W80","v":2298.7536941961771},{"$f":"Ripartizioni!$E95*Ripartizioni!X80","v":0},{"$f":"Ripartizioni!$E95*Ripartizioni!Y80","v":0},338020.23696307687,{"$f":"Ripartizioni!$E95*Ripartizioni!Z80","v":140798.66376951587},null,null,null,null,null,{"$f":"Ripartizioni!$E95*Ripartizioni!AF80","v":0},null,null,null,null,null,null,null,140798.66376951587,null,null,null,null,null,null,null,null,null,null,null,null,null,null,null,null,null,null,null,null,{"$f":"IF(ABS(Q52+AA52+AP52+AR52+AU52+BF52+BH52)<0.0001,0,Q52+AA52+AP52+AR52+AU52+BF52+BH52)","v":0}]
["RIP040","Ripartizione Economia domestica in generale",{"$f":"Ripartizioni!C37","v":"% retribuzione"},{"$f":"Ripartizioni!E81","v":0.99048854301772582},{"$f":"Ripartizioni!E96","v":122571.00856166273},{"$f":"Ripartizioni!$E96*Ripartizioni!F81","v":0},{"$f":"Ripartizioni!$E96*Ripartizioni!G81","v":0},{"$f":"Ripartizioni!$E96*Ripartizioni!H81","v":1610.9635366513389},{"$f":"Ripartizioni!$E96*Ripartizioni!I81","v":0},{"$f":"Ripartizioni!$E96*Ripartizioni!J81","v":6350.5878365886992},{"$f":"-SUM(K46,K48:K52,K54:K58)","v":-121405.17968645452},{"$f":"Ripartizioni!$E96*Ripartizioni!L81","v":5988.1210408421484},{"$f":"Ripartizioni!$E96*Ripartizioni!M81","v":5776.152154440656},{"$f":"Ripartizioni!$E96*Ripartizioni!N81","v":13163.267845532651},{"$f":"Ripartizioni!$E96*Ripartizioni!O81","v":0},{"$f":"Ripartizioni!$E96*Ripartizioni!P81","v":211.96888640149197},-88304.118385997528,{"$f":"Ripartizioni!$E96*Ripartizioni!Q81","v":0},{"$f":"Ripartizioni!$E96*Ripartizioni!R81","v":4597.6051460483604},{"$f":"Ripartizioni!$E96*Ripartizioni!S81","v":54974.130688226942},{"$f":"Ripartizioni!$E96*Ripartizioni!T81","v":529.92221600373},{"$f":"Ripartizioni!$E96*Ripartizioni!U81","v":964.45843312678846},{"$f":"Ripartizioni!$E96*Ripartizioni!V81","v":847.87554560596789},{"$f":"Ripartizioni!$E96*Ripartizioni!W81","v":423.93777280298394},{"$f":"Ripartizioni!$E96*Ripartizioni!X81","v":0},{"$f":"Ripartizioni!$E96*Ripartizioni!Y81","v":0},62337.929801814775,{"$f":"Ripartizioni!$E96*Ripartizioni!Z81","v":25966.188584182768},null,null,null,null,null,{"$f":"Ripartizioni!$E96*Ripartizioni!AF81","v":0},null,null,null,null,null,null,null,25966.188584182768,null,null,null,null,null,null,null,null,null,null,null,null,null,null,null,null,null,null,null,null,0]
["RIP041","Ripartizione Lavanderia",{"$f":"Ripartizioni!C38","v":"kg (sistematico)"},{"$f":"Ripartizioni!E82","v":41580},{"$f":"Ripartizioni!E97","v":11.233045616505501},{"$f":"Ripartizioni!$E97*Ripartizioni!F82","v":0},{"$f":"Ripartizioni!$E97*Ripartizioni!G82","v":0},{"$f":"Ripartizioni!$E97*Ripartizioni!H82","v":2246.6091233011002},{"$f":"Ripartizioni!$E97*Ripartizioni!I82","v":0},{"$f":"Ripartizioni!$E97*Ripartizioni!J82","v":0},{"$f":"Ripartizioni!$E97*Ripartizioni!K82","v":2246.6091233011002},{"$f":"-SUM(L46,L48:L53,L55:L58)","v":-467070.03673429874},{"$f":"Ripartizioni!$E97*Ripartizioni!M82","v":22466.091233011004},{"$f":"Ripartizioni!$E97*Ripartizioni!N82","v":13479.654739806601},{"$f":"Ripartizioni!$E97*Ripartizioni!O82","v":0},{"$f":"Ripartizioni!$E97*Ripartizioni!P82","v":0},-426631.07251487894,{"$f":"Ripartizioni!$E97*Ripartizioni!Q82","v":292059.18602914305},{"$f":"Ripartizioni!$E97*Ripartizioni!R82","v":2246.6091233011002},{"$f":"Ripartizioni!$E97*Ripartizioni!S82","v":33699.136849516508},{"$f":"Ripartizioni!$E97*Ripartizioni!T82","v":954.8088774029676},{"$f":"Ripartizioni!$E97*Ripartizioni!U82","v":1067.1393335680227},{"$f":"Ripartizioni!$E97*Ripartizioni!V82","v":0},{"$f":"Ripartizioni!$E97*Ripartizioni!W82","v":0},{"$f":"Ripartizioni!$E97*Ripartizioni!X82","v":0},{"$f":"Ripartizioni!$E97*Ripartizioni!Y82","v":0},330026.88021293172,{"$f":"Ripartizioni!$E97*Ripartizioni!Z82","v":96604.192301947318},null,null,null,null,null,{"$f":"Ripartizioni!$E97*Ripartizioni!AF82","v":0},null,null,null,null,null,null,null,96604.192301947318,null,null,null,null,null,null,null,null,null,null,null,null,null,null,null,null,null,null,null,null,0]
["RIP042","Ripartizione Pulizie",{"$f":"Ripartizioni!C39","v":"m2"},{"$f":"Ripartizioni!E83","v":4395},{"$f":"Ripartizioni!E98","v":100.36839097824316},{"$f":"Ripartizioni!$E98*Ripartizioni!F83","v":0},{"$f":"Ripartizioni!$E98*Ripartizioni!G83","v":7527.6293233682363},{"$f":"Ripartizioni!$E98*Ripartizioni!H83","v":5018.4195489121576},{"$f":"Ripartizioni!$E98*Ripartizioni!I83","v":0},{"$f":"Ripartizioni!$E98*Ripartizioni!J83","v":10036.839097824315},{"$f":"Ripartizioni!$E98*Ripartizioni!K83","v":8029.4712782594524},{"$f":"Ripartizioni!$E98*Ripartizioni!L83","v":10036.839097824315},{"$f":"-SUM(M46,M48:M54,M56:M58)","v":-441119.07834937866},{"$f":"Ripartizioni!$E98*Ripartizioni!N83","v":32117.88511303781},{"$f":"Ripartizioni!$E98*Ripartizioni!O83","v":0},{"$f":"Ripartizioni!$E98*Ripartizioni!P83","v":0},-368351.99489015236,{"$f":"Ripartizioni!$E98*Ripartizioni!Q83","v":250920.97744560789},{"$f":"Ripartizioni!$E98*Ripartizioni!R83","v":12044.20691738918},{"$f":"Ripartizioni!$E98*Ripartizioni!S83","v":10036.839097824315},{"$f":"Ripartizioni!$E98*Ripartizioni!T83","v":4265.6566165753338},{"$f":"Ripartizioni!$E98*Ripartizioni!U83","v":4767.4985714665499},{"$f":"Ripartizioni!$E98*Ripartizioni!V83","v":0},{"$f":"Ripartizioni!$E98*Ripartizioni!W83","v":0},{"$f":"Ripartizioni!$E98*Ripartizioni!X83","v":0},{"$f":"Ripartizioni!$E98*Ripartizioni!Y83","v":1003.6839097824316},283038.86255864566,{"$f":"Ripartizioni!$E98*Ripartizioni!Z83","v":85313.132331506684},null,null,null,null,null,{"$f":"Ripartizioni!$E98*Ripartizioni!AF83","v":0},null,null,null,null,null,null,null,85313.132331506684,null,null,null,null,null,null,null,null,null,null,null,null,null,null,null,null,null,null,null,null,0]
["RIP060","Ripartizione Cucina",{"$f":"Ripartizioni!C40","v":"Numero di pasti"},{"$f":"Ripartizioni!E84","v":74400},{"$f":"Ripartizioni!E99","v":17.171719244090273},{"$f":"Ripartizioni!$E99*Ripartizioni!F84","v":0},{"$f":"Ripartizioni!$E99*Ripartizioni!G84","v":0},{"$f":"Ripartizioni!$E99*Ripartizioni!H84","v":0},{"$f":"Ripartizioni!$E99*Ripartizioni!I84","v":0},{"$f":"Ripartizioni!$E99*Ripartizioni!J84","v":0},{"$f":"Ripartizioni!$E99*Ripartizioni!K84","v":0},{"$f":"Ripartizioni!$E99*Ripartizioni!L84","v":0},{"$f":"Ripartizioni!$E99*Ripartizioni!M84","v":0},{"$f":"-SUM(N46,N48:N55,N57:N58)","v":-1277575.9117603162},{"$f":"Ripartizioni!$E99*Ripartizioni!O84","v":0},{"$f":"Ripartizioni!$E99*Ripartizioni!P84","v":0},-1277575.9117603162,{"$f":"Ripartizioni!$E99*Ripartizioni!Q84","v":1107575.8912438226},{"$f":"Ripartizioni!$E99*Ripartizioni!R84","v":0},{"$f":"Ripartizioni!$E99*Ripartizioni!S84","v":0},{"$f":"Ripartizioni!$E99*Ripartizioni!T84","v":0},{"$f":"Ripartizioni!$E99*Ripartizioni!U84","v":0},{"$f":"Ripartizioni!$E99*Ripartizioni!V84","v":0},{"$f":"Ripartizioni!$E99*Ripartizioni!W84","v":0},{"$f":"Ripartizioni!$E99*Ripartizioni!X84","v":0},{"$f":"Ripartizioni!$E99*Ripartizioni!Y84","v":0},1107575.8912438226,{"$f":"Ripartizioni!$E99*Ripartizioni!Z84","v":170000.02051649371},null,null,null,null,null,{"$f":"Ripartizioni!$E99*Ripartizioni!AF84","v":0},null,null,null,null,null,null,null,170000.02051649371,null,null,null,null,null,null,null,null,null,null,null,null,null,null,null,null,null,null,null,null,0]
["RIP090","Ripartizione Magazzino centrale",{"$f":"Ripartizioni!C41","v":"Allocazione diretta"},{"$f":"Ripartizioni!E85","v":0},{"$f":"Ripartizioni!E100","v":0},{"$f":"Ripartizioni!$E100*Ripartizioni!F85","v":0},{"$f":"Ripartizioni!$E100*Ripartizioni!G85","v":0},{"$f":"Ripartizioni!$E100*Ripartizioni!H85","v":0},{"$f":"Ripartizioni!$E100*Ripartizioni!I85","v":0},{"$f":"Ripartizioni!$E100*Ripartizioni!J85","v":0},{"$f":"Ripartizioni!$E100*Ripartizioni!K85","v":0},{"$f":"Ripartizioni!$E100*Ripartizioni!L85","v":0},{"$f":"Ripartizioni!$E100*Ripartizioni!M85","v":0},{"$f":"Ripartizioni!$E100*Ripartizioni!N85","v":0},{"$f":"-SUM(O46,O48:O56,O58)","v":0},{"$f":"Ripartizioni!$E100*Ripartizioni!P85","v":0},0,{"$f":"Ripartizioni!$E100*Ripartizioni!Q85","v":0},{"$f":"Ripartizioni!$E100*Ripartizioni!R85","v":0},{"$f":"Ripartizioni!$E100*Ripartizioni!S85","v":0},{"$f":"Ripartizioni!$E100*Ripartizioni!T85","v":0},{"$f":"Ripartizioni!$E100*Ripartizioni!U85","v":0},{"$f":"Ripartizioni!$E100*Ripartizioni!V85","v":0},{"$f":"Ripartizioni!$E100*Ripartizioni!W85","v":0},{"$f":"Ripartizioni!$E100*Ripartizioni!X85","v":0},{"$f":"Ripartizioni!$E100*Ripartizioni!Y85","v":0},{"$f":"SUM(R57:Z57)","v":0},{"$f":"Ripartizioni!$E100*Ripartizioni!Z85","v":0},null,null,null,null,null,{"$f":"Ripartizioni!$E100*Ripartizioni!AF85","v":0},null,null,null,null,null,null,null,{"$f":"SUM(AB57:AO57)","v":0},null,null,null,null,null,null,null,null,null,null,null,null,null,null,null,null,null,null,null,null,0]
["RIP095","Ripartizione Farmacia",{"$f":"Ripartizioni!C42","v":"Allocazione diretta"},{"$f":"Ripartizioni!E86","v":188000},{"$f":"Ripartizioni!E101","v":0.13335449482054171},{"$f":"Ripartizioni!$E101*Ripartizioni!F86","v":0},{"$f":"Ripartizioni!$E101*Ripartizioni!G86","v":0},{"$f":"Ripartizioni!$E101*Ripartizioni!H86","v":0},{"$f":"Ripartizioni!$E101*Ripartizioni!I86","v":0},{"$f":"Ripartizioni!$E101*Ripartizioni!J86","v":0},{"$f":"Ripartizioni!$E101*Ripartizioni!K86","v":0},{"$f":"Ripartizioni!$E101*Ripartizioni!L86","v":0},{"$f":"Ripartizioni!$E101*Ripartizioni!M86","v":0},{"$f":"Ripartizioni!$E101*Ripartizioni!N86","v":0},{"$f":"Ripartizioni!$E101*Ripartizioni!O86","v":0},{"$f":"-SUM(P46,P48:P57)","v":-25070.645026261842},-25070.645026261842,{"$f":"Ripartizioni!$E101*Ripartizioni!Q86","v":0},{"$f":"Ripartizioni!$E101*Ripartizioni!R86","v":0},{"$f":"Ripartizioni!$E101*Ripartizioni!S86","v":0},{"$f":"Ripartizioni!$E101*Ripartizioni!T86","v":0},{"$f":"Ripartizioni!$E101*Ripartizioni!U86","v":0},{"$f":"Ripartizioni!$E101*Ripartizioni!V86","v":0},{"$f":"Ripartizioni!$E101*Ripartizioni!W86","v":0},{"$f":"Ripartizioni!$E101*Ripartizioni!X86","v":8001.2696892325021},{"$f":"Ripartizioni!$E101*Ripartizioni!Y86","v":10001.587111540628},{"$f":"SUM(R58:Z58)","v":18002.85680077313},{"$f":"Ripartizioni!$E101*Ripartizioni!Z86","v":7067.7882254887109},null,null,null,null,null,{"$f":"Ripartizioni!$E101*Ripartizioni!AF86","v":0},null,null,null,null,null,null,null,{"$f":"SUM(AB58:AO58)","v":7067.7882254887109},null,null,null,null,null,null,null,null,null,null,null,null,null,null,null,null,null,null,null,null,0]
[null,"Totale costi dei CdC generali dopo ripartizioni",null,null,null,{"$f":"-F48","v":1373872.2483660132},{"$f":"-G49","v":153093.60593138702},{"$f":"-H50","v":143338.23605176195},{"$f":"-I51","v":11740},{"$f":"-J52","v":630191.831495411},{"$f":"-K53","v":121405.17968645452},{"$f":"-L54","v":467070.03673429874},{"$f":"-M55","v":441119.07834937866},{"$f":"-N56","v":1277575.9117603162},{"$f":"-O57","v":0},{"$f":"-P58","v":25070.645026261842}]
[null,"Costi NETTI dopo ripartizioni",null,null,null,{"$f":"SUM(F46:F58)","v":0},{"$f":"SUM(G46:G58)","v":1.3642420526593924E-11},{"$f":"SUM(H46:H58)","v":4.5474735088646412E-12},0,-1.4551915228366852E-11,-9.0949470177292824E-13,1.8189894035458565E-11,0,0,0,0,7.6397554948925972E-11,2649002.9458330134,363348.23953906575,3771808.5128371362,57777.155208578362,87746.323705700255,54634.580105047353,27417.290052523676,68001.269689232504,89776.818585780813,7169513.1355560785,{"$f":"SUM(AB46:AC58)","v":2378750.6920714215},null,{"$f":"SUM(AD46:AD58)","v":0},0,0,{"$f":"SUM(AG46:AG58)","v":0},0,0,0,0,0,0,0,0,{"$f":"SUM(AP46:AP58)","v":2378750.6920714215},0,{"$f":"SUM(AR46:AR58)","v":0},{"$f":"SUM(AS46:AS58)","v":0},{"$f":"SUM(AT46:AT58)","v":0},{"$f":"SUM(AU46:AU58)","v":0},0,0,0,{"$f":"SUM(AY46:AY58)","v":0},{"$f":"SUM(AZ46:AZ58)","v":0},{"$f":"SUM(BA46:BA58)","v":0},{"$f":"SUM(BB46:BB58)","v":0},0,0,0,0,0,0]
["Voci di ricavo",null,"COFI\nContabilità \nfinanziaria\nRicavi","Delimitazioni\nper SOMED-A ","COAN\nContabilità analitica\nper SOMED-A\nRicavi"]
[6000,"Rette - Anziani",-2357500,0,{"$f":"C62+D62","v":-2357500},null,null,null,null,null,null,null,null,null,null,null,null,-2100000,null,-87500,null,null,null,null,null,null,{"$f":"SUM(R62:Z62)","v":-2187500},-170000,null,null,null,null,null,null,0,null,null,null,null,null,null,{"$f":"SUM(AB62:AO62)","v":-170000},null,null,null,null,null,null,null,null,null,null,null,null,null,null,null,null,null,null,null,null,{"$f":"IF(ABS(E62-Q62-AA62-AP62-AR62-AU62-BF62-BH62)<0.0001,0,E62-Q62-AA62-AP62-AR62-AU62-BF62-BH62)","v":0}]
[6001,"Partecipazioni delle casse malati",-2070000,0,{"$f":"C63+D63","v":-2070000},null,null,null,null,null,null,null,null,null,null,null,null,null,null,-1550000,{"$f":"-20000-20000","v":-40000},{"$f":"-30000-30000","v":-60000},-5000,0,0,{"$f":"-25000-90000","v":-115000},{"$f":"SUM(R63:Z63)","v":-1770000},-300000,null,null,null,null,0,null,0,null,null,null,null,null,null,{"$f":"SUM(AB63:AO63)","v":-300000},null,{"$f":"SUM(AQ63)","v":0},{"$f":"-90000+90000","v":0},{"$f":"-50000+50000","v":0},{"$f":"SUM(AS63:AT63)","v":0},null,null,null,null,null,null,null,null,null,null,null,null,null,null,null,0]
[6002,"Assegni grandi invalidi - Anziani",-315000,0,-315000,null,null,null,null,null,null,null,null,null,null,null,null,null,null,-315000,null,null,null,null,null,null,-315000,null,null,null,null,null,null,null,0,null,null,null,null,null,null,0,null,null,null,null,null,null,null,null,null,null,null,null,null,null,null,null,null,null,null,null,0]
[6003,"Altri ricavi - Anziani",0,0,0,null,null,null,null,null,null,null,null,null,null,null,null,null,null,null,null,null,null,null,null,0,0,null,null,null,null,null,null,null,null,null,null,null,null,null,null,null,null,0,null,null,0,0,0,0,0,0,0,0,0,0,0,{"$f":"SUM(AV65:BE65)","v":0},0,{"$f":"SUM(BG65)","v":0},null,null,0]
[601,"Altri ricavi - Settore di attività n ",0,0,0,null,null,null,null,null,null,null,null,null,null,null,null,null,null,null,null,null,null,null,null,null,null,null,null,null,null,null,null,null,null,null,null,null,null,null,null,null,null,0,null,null,0,0,0,0,0,0,0,0,0,0,0,{"$f":"SUM(AV66:BE66)","v":0},0,{"$f":"SUM(BG66)","v":0},null,null,0]
[609,"Diminuzioni ricavi…. (perdite su debitori anni precedenti) tralasciato per SOMED",null,null,null,null,null,null,null,null,null,null,null,null,null,null,null,null,null,null,null,null,null,null,null,null,null,null,null,null,null,null,null,null,null,null,null,null,null,null,null,null,null,null,null,null,null,null,null,null,null,null,null,null,null,null,null,null,null,null,null,null,0]
[61,"Ricavi da prestazioni mediche singole (secondo TARMED) ",0,null,0,null,null,null,null,null,null,null,null,null,null,null,null,null,null,null,null,null,null,null,null,null,null,null,null,null,null,null,null,null,null,null,null,null,null,null,null,0,null,0,null,null,0,null,null,null,null,null,null,null,null,null,null,null,null,null,null,null,0]
[62,"Ricavi da prestazioni diagnostiche e terapeutiche singole (ambulatoriali) ",0,null,0,null,null,null,null,null,null,null,null,null,null,null,null,null,null,null,null,null,null,null,null,null,null,null,null,null,null,null,null,null,null,null,null,null,null,null,null,0,null,0,null,null,0,null,null,null,null,null,null,null,null,null,null,null,null,null,null,null,0]
[69,"Contributi e sussidi",-4659018.9600000009,null,{"$f":"C70+D70","v":-4659018.9600000009},null,null,null,null,null,null,null,null,null,null,null,null,-1134567.33,null,{"$f":"-1500000-65281.88-221562.3","v":-1786844.18},-20000,-30000,-50000,0,-70000,null,-3091411.51,-1567607.45,null,null,null,null,0,null,0,null,{"$f":"-1134567.33+1134567.33","v":0},{"$f":"-65281.88+65281.88","v":0},null,null,{"$f":"-221562.3+221562.3","v":0},-1567607.45,null,null,null,null,null,null,null,null,null,null,null,null,null,null,null,null,null,null,null,null,0]
[null,"Totale  Ricavi",{"$f":"SUM(C62:C70)","v":-9401518.9600000009},{"$f":"SUM(D62:D70)","v":0},{"$f":"SUM(E62:E70)","v":-9401518.9600000009},null,null,null,null,null,null,null,null,null,null,null,null,{"$f":"SUM(R62:R70)","v":-3234567.33},{"$f":"SUM(S62:S70)","v":0},-3739344.1799999997,-60000,-90000,-55000,0,-70000,-115000,{"$f":"SUM(AA62:AA70)","v":-7363911.5099999998},-2037607.45,null,0,0,0,0,0,0,0,0,0,0,0,0,-2037607.45,0,0,{"$f":"SUM(AS62:AS70)","v":0},0,0,0,0,0,0,0,0,0,0,0,0,0,0,{"$f":"SUM(BH62:BH70)","v":0},null,null,0]
[null,"Risultato di gestione   - ricalcolato per SOMED",{"$f":"C71+C46","v":741118.95999999903},null,{"$f":"E71+E46","v":146744.86762749776},null,null,null,null,null,null,null,null,null,null,null,null,{"$f":"R71+R60","v":-585564.38416698668},363348.23953906575,32464.332837136462,-2222.8447914216376,-2253.6762942997448,-365.41989495264716,27417.290052523676,-1998.7303107674961,-25223.181414219187,-194398.37444392126,341143.24207142158,null,{"$f":"AD71+AD60","v":0},0,0,0,{"$f":"AH71+AH60","v":0},0,0,0,0,0,0,0,{"$f":"AP71+AP60","v":341143.24207142158},0,0,0,0,0,0,0,0,0,0,0,0,0,0,0,0,0,0,null,null,0]
[null,null,null,null,null,null,null,null,null,null,null,null,null,null,null,null,null,null,null,null,null,null,null,null,null,null,null,null,null,null,null,null,null,null,null,null,null,null,null,null,null,null,null,null,null,null,null,null,null,null,null,null,null,null,null,null,null,null,null,null,null,null,"Risultato totale"]
[null,null,null,null,null,null,null,null,null,null,null,null,null,null,null,null,null,null,null,null,null,null,null,null,null,null,null,null,null,null,null,null,null,null,null,null,null,null,null,null,null,null,null,null,null,null,null,null,null,null,null,null,null,null,null,null,null,null,null,null,null,null,{"$f":"AA72+AP72+AR72+AU72+BF72+BH72+BI72","v":146744.86762750032}]
[null,null,null,null,null,null,null,null,null,null,null,null,null,null,null,null,null,null,null,null,null,null,null,null,null,null,null,null,null,null,null,null,null,null,null,null,null,null,null,null,null,null,null,null,null,null,null,null,null,null,null,null,null,null,null,null,null,null,null,null,null,null,"quando < 0"," = utile"]
[null,null,null,null,null,null,null,null,null,null,null,null,null,null,null,null,null,null,null,null,null,null,null,null,null,null,null,null,null,null,null,null,null,null,null,null,null,null,null,null,null,null,null,null,null,null,null,null,null,null,null,null,null,null,null,null,null,null,null,null,null,null,"quando > 0"," = perdita"]

{"sheet":"Contabilità per UFI - SOMED","index":8,"n_rows":89,"n_cols":22,"rows_kept":89,"cut":false,"hidden":false,"merged":[[5,20,5,21],[6,20,6,21],[6,4,6,5],[5,6,5,7],[6,6,6,7],[5,4,5,5],[56,12,56,13],[57,12,57,13],[75,12,75,13],[76,12,76,13],[62,12,62,13],[63,12,63,13],[58,12,58,13],[59,12,59,13],[61,12,61,13]]}
[]
["Contabilità analitica per UFI per  S O M E D   (in CHF)",null,null,null,null,null,null,{"$f":"Parametri!$B$7","v":2021},{"$f":"Parametri!$B$3","v":"ESEMPIO - CPA STANDARD CON CAT-STT"}]
[]
[]
["Ricapitolazione dei conti UACD usati per SOMED",null,null,null,"Costi E0  (CdC generali + CDT) ",null,null,null,null,"Costi E1  (CdC finali della CPA) ",null,null,null,null,null,null,null,null,null,null,"Costi E5 (CAT-STT)"]
["C.to COAN TI","Cto","Decrizione c.to SOMED",null,"Costi totali dei CdC",null,"Costi totali dei CdC generali ",null,null,"     C o s t i   d e i    C d C   f i n a l i    d e l l a    C P A",null,null,null,null,null,null,null,null,null,null,"Costi tot. dei CdC generali "]
[null,"SOMED",null,null,"generali della CPA",null,"e finali del Centro D. T.",null,null,null,"Totale","Servizio","Animazione","Cura non ","Cura LAMal","Terapie","Medico","Medicamenti ","Materiale ",null,"e finali del rep. CAT-STT"]
[null,null,null,null,"E0 ",null,"E0 - 160",null,null,"E1",null,"alberghiero ",null,"LAMal",null,null,null,"ES / EMT","EMAp",null,"E5 "]
[3000,30,"Salari medici e altri accademici",null,"E0.30.01",{"$f":"ROUND('Contabilità per CDC - SOMED'!Q9,0)","v":0},"E0.30.160",{"$f":"ROUND('Contabilità per CDC - SOMED'!AH9,0)","v":0},null,"E1.30",{"$f":"SUM(L9:S9)","v":20000},{"$f":"ROUND('Contabilità per CDC - SOMED'!R9,0)","v":0},{"$f":"ROUND('Contabilità per CDC - SOMED'!S9,0)","v":0},{"$f":"ROUND('Contabilità per CDC - SOMED'!T9*'Contabilità per UFI 1'!E9,0)","v":0},{"$f":"ROUND('Contabilità per CDC - SOMED'!T9*'Contabilità per UFI 1'!G9,0)","v":0},{"$f":"ROUND(SUM('Contabilità per CDC - SOMED'!U9,'Contabilità per CDC - SOMED'!V9,'Contabilità per CDC - SOMED'!W9),0)","v":0},{"$f":"ROUND('Contabilità per CDC - SOMED'!X9,0)","v":20000},{"$f":"ROUND('Contabilità per CDC - SOMED'!Z9,0)","v":0},{"$f":"ROUND('Contabilità per CDC - SOMED'!Y9,0)","v":0},null,"E5.30.05",{"$f":"ROUND(SUM('Contabilità per CDC - SOMED'!AB9:AC9),0)","v":150000}]
["3001.00+05+10+3009-309\n",311,"Salari personale di cura qualificato (infermieri e OSS)",null,"E0.311.01",{"$f":"ROUND(SUM('Contabilità per CDC - SOMED'!Q10:Q12,'Contabilità per CDC - SOMED'!Q20)-'Contabilità per CDC - SOMED'!Q21,0)","v":86600},"E0.311.160",{"$f":"ROUND(SUM('Contabilità per CDC - SOMED'!AH10:AH12,'Contabilità per CDC - SOMED'!AH20)-'Contabilità per CDC - SOMED'!AH21,0)","v":0},null,"E1.311",{"$f":"SUM(L10:S10)","v":1454900},{"$f":"ROUND(SUM('Contabilità per CDC - SOMED'!R10:R12,'Contabilità per CDC - SOMED'!R20)-'Contabilità per CDC - SOMED'!R21,0)","v":0},{"$f":"ROUND(SUM('Contabilità per CDC - SOMED'!S10:S12,'Contabilità per CDC - SOMED'!S20)-'Contabilità per CDC - SOMED'!S21,0)","v":36900},{"$f":"ROUND((SUM('Contabilità per CDC - SOMED'!T10:T12,'Contabilità per CDC - SOMED'!T20)-'Contabilità per CDC - SOMED'!T21)*'Contabilità per UFI 1'!E12,0)","v":14180},{"$f":"ROUND((SUM('Contabilità per CDC - SOMED'!T10:T12,'Contabilità per CDC - SOMED'!T20)-'Contabilità per CDC - SOMED'!T21)*'Contabilità per UFI 1'!G12,0)","v":1403820},{"$f":"ROUND(SUM('Contabilità per CDC - SOMED'!U10:U12,'Contabilità per CDC - SOMED'!U20,'Contabilità per CDC - SOMED'!V10:V12,'Contabilità per CDC - SOMED'!V20,'Contabilità per CDC - SOMED'!W10:W12,'Contabilità per CDC - SOMED'!W20)-SUM('Contabilità per CDC - SOMED'!U21,'Contabilità per CDC - SOMED'!V21,'Contabilità per CDC - SOMED'!W21),0)","v":0},{"$f":"ROUND(SUM('Contabilità per CDC - SOMED'!X10:X12,'Contabilità per CDC - SOMED'!X20)-'Contabilità per CDC - SOMED'!X21,0)","v":0},{"$f":"ROUND(SUM('Contabilità per CDC - SOMED'!Z10:Z12,'Contabilità per CDC - SOMED'!Z20)-'Contabilità per CDC - SOMED'!Z21,0)","v":0},{"$f":"ROUND(SUM('Contabilità per CDC - SOMED'!Y10:Y12,'Contabilità per CDC - SOMED'!Y20)-'Contabilità per CDC - SOMED'!Y21,0)","v":0},null,"E5.311.05",{"$f":"ROUND(SUM('Contabilità per CDC - SOMED'!AB10:AB12,'Contabilità per CDC - SOMED'!AC10:AC12,'Contabilità per CDC - SOMED'!AB20,'Contabilità per CDC - SOMED'!AC20)-SUM('Contabilità per CDC - SOMED'!AB21,'Contabilità per CDC - SOMED'!AC21,0),0)","v":525000}]
[3001.2,312,"Salari personale assistente di cura (e ausiliari di cura - ACS)",null,"E0.312.01",{"$f":"ROUND('Contabilità per CDC - SOMED'!Q13,0)","v":230000},"E0.312.160",{"$f":"ROUND('Contabilità per CDC - SOMED'!AH13,0)","v":0},null,"E1.312",{"$f":"SUM(L11:S11)","v":1245000},{"$f":"ROUND('Contabilità per CDC - SOMED'!R13,0)","v":0},{"$f":"ROUND('Contabilità per CDC - SOMED'!S13,0)","v":55000},{"$f":"ROUND('Contabilità per CDC - SOMED'!T13*'Contabilità per UFI 1'!E13,0)","v":11900},{"$f":"ROUND('Contabilità per CDC - SOMED'!T13*'Contabilità per UFI 1'!G13,0)","v":1178100},{"$f":"ROUND(SUM('Contabilità per CDC - SOMED'!U13,'Contabilità per CDC - SOMED'!V13,'Contabilità per CDC - SOMED'!W13),0)","v":0},{"$f":"ROUND('Contabilità per CDC - SOMED'!X13,0)","v":0},{"$f":"ROUND('Contabilità per CDC - SOMED'!Z13,0)","v":0},{"$f":"ROUND('Contabilità per CDC - SOMED'!Y13,0)","v":0},null,"E5.312.",{"$f":"ROUND(SUM('Contabilità per CDC - SOMED'!AB13:AC13),0)","v":430000}]
[3001.9,313,"Salari personale di cura in prima formazione e stagisti",null,"E0.313.01",{"$f":"ROUND('Contabilità per CDC - SOMED'!Q15,0)","v":0},"E0.313.160",{"$f":"ROUND('Contabilità per CDC - SOMED'!AH15,0)","v":0},null,"E1.313",35500,{"$f":"ROUND('Contabilità per CDC - SOMED'!R15,0)","v":0},{"$f":"ROUND('Contabilità per CDC - SOMED'!S15,0)","v":0},{"$f":"ROUND('Contabilità per CDC - SOMED'!T15*'Contabilità per UFI 1'!E15,0)","v":35145},{"$f":"ROUND('Contabilità per CDC - SOMED'!T15*'Contabilità per UFI 1'!G15,0)","v":355},{"$f":"ROUND(SUM('Contabilità per CDC - SOMED'!U15,'Contabilità per CDC - SOMED'!V15,'Contabilità per CDC - SOMED'!W15),0)","v":0},{"$f":"ROUND('Contabilità per CDC - SOMED'!X15,0)","v":0},{"$f":"ROUND('Contabilità per CDC - SOMED'!Z15,0)","v":0},{"$f":"ROUND('Contabilità per CDC - SOMED'!Y15,0)","v":0},null,"E5.313.",{"$f":"ROUND(SUM('Contabilità per CDC - SOMED'!AB15:AC15),0)","v":0}]
[3002,32,"Salari personale altre discipline mediche specializzate ",null,"E0.32.01",{"$f":"ROUND(SUM('Contabilità per CDC - SOMED'!Q16,'Contabilità per CDC - SOMED'!Q14),0)","v":17500},"E0.32.160",{"$f":"ROUND(SUM('Contabilità per CDC - SOMED'!AH16,'Contabilità per CDC - SOMED'!AH14),0)","v":0},null,"E1.32",235500,{"$f":"ROUND(SUM('Contabilità per CDC - SOMED'!R16,'Contabilità per CDC - SOMED'!R14),0)","v":0},{"$f":"ROUND(SUM('Contabilità per CDC - SOMED'!S16,'Contabilità per CDC - SOMED'!S14),0)","v":125000},{"$f":"ROUND(SUM('Contabilità per CDC - SOMED'!T16,'Contabilità per CDC - SOMED'!T14)*'Contabilità per UFI 1'!E16,0)","v":0},{"$f":"ROUND(SUM('Contabilità per CDC - SOMED'!T16,'Contabilità per CDC - SOMED'!T14)*'Contabilità per UFI 1'!G16,0)","v":0},{"$f":"ROUND(SUM('Contabilità per CDC - SOMED'!U16,'Contabilità per CDC - SOMED'!U14,'Contabilità per CDC - SOMED'!V16,'Contabilità per CDC - SOMED'!V14,'Contabilità per CDC - SOMED'!W16,'Contabilità per CDC - SOMED'!W14),0)","v":110500},{"$f":"ROUND(SUM('Contabilità per CDC - SOMED'!X16,'Contabilità per CDC - SOMED'!X14),0)","v":0},{"$f":"ROUND(SUM('Contabilità per CDC - SOMED'!Z16,'Contabilità per CDC - SOMED'!Z14),0)","v":0},{"$f":"ROUND(SUM('Contabilità per CDC - SOMED'!Y16,'Contabilità per CDC - SOMED'!Y14),0)","v":0},null,"E5.32.",{"$f":"ROUND(SUM('Contabilità per CDC - SOMED'!AB16:AC16,'Contabilità per CDC - SOMED'!AB14:AC16),0)","v":240000}]
[3003,33,"Salari personale amministrativo",null,"E0.33.01",{"$f":"ROUND('Contabilità per CDC - SOMED'!Q17,0)","v":261500},"E0.33.160",{"$f":"ROUND('Contabilità per CDC - SOMED'!AH17,0)","v":0},null,"E1.33",0,{"$f":"ROUND('Contabilità per CDC - SOMED'!R17,0)","v":0},{"$f":"ROUND('Contabilità per CDC - SOMED'!S17,0)","v":0},{"$f":"ROUND('Contabilità per CDC - SOMED'!T17*'Contabilità per UFI 1'!E17,0)","v":0},{"$f":"ROUND('Contabilità per CDC - SOMED'!T17*'Contabilità per UFI 1'!G17,0)","v":0},{"$f":"ROUND(SUM('Contabilità per CDC - SOMED'!U17,'Contabilità per CDC - SOMED'!V17,'Contabilità per CDC - SOMED'!W17),0)","v":0},{"$f":"ROUND('Contabilità per CDC - SOMED'!X17,0)","v":0},{"$f":"ROUND('Contabilità per CDC - SOMED'!Z17,0)","v":0},{"$f":"ROUND('Contabilità per CDC - SOMED'!Y17,0)","v":0},null,"E5.33.",{"$f":"ROUND(SUM('Contabilità per CDC - SOMED'!AB17:AC17),0)","v":0}]
[3004,34,"Salari personale servizio alberghiero / economato",null,"E0.34.01",{"$f":"ROUND('Contabilità per CDC - SOMED'!Q18,0)","v":945000},"E0.34.160",{"$f":"ROUND('Contabilità per CDC - SOMED'!AH18,0)","v":0},null,"E1.34",0,{"$f":"ROUND('Contabilità per CDC - SOMED'!R18,0)","v":0},{"$f":"ROUND('Contabilità per CDC - SOMED'!S18,0)","v":0},{"$f":"ROUND('Contabilità per CDC - SOMED'!T18*'Contabilità per UFI 1'!E18,0)","v":0},{"$f":"ROUND('Contabilità per CDC - SOMED'!T18*'Contabilità per UFI 1'!G18,0)","v":0},{"$f":"ROUND(SUM('Contabilità per CDC - SOMED'!U18,'Contabilità per CDC - SOMED'!V18,'Contabilità per CDC - SOMED'!W18),0)","v":0},{"$f":"ROUND('Contabilità per CDC - SOMED'!X18,0)","v":0},{"$f":"ROUND('Contabilità per CDC - SOMED'!Z18,0)","v":0},{"$f":"ROUND('Contabilità per CDC - SOMED'!Y18,0)","v":0},null,"E5.34.",{"$f":"ROUND(SUM('Contabilità per CDC - SOMED'!AB18:AC18),0)","v":0}]
[3005,35,"Salari personale servizio tecnico",null,"E0.35.01",{"$f":"ROUND('Contabilità per CDC - SOMED'!Q19,0)","v":76000},"E0.35.160",{"$f":"ROUND('Contabilità per CDC - SOMED'!AH19,0)","v":0},null,"E1.35",0,{"$f":"ROUND('Contabilità per CDC - SOMED'!R19,0)","v":0},{"$f":"ROUND('Contabilità per CDC - SOMED'!S19,0)","v":0},{"$f":"ROUND('Contabilità per CDC - SOMED'!T19*'Contabilità per UFI 1'!E19,0)","v":0},{"$f":"ROUND('Contabilità per CDC - SOMED'!T19*'Contabilità per UFI 1'!G19,0)","v":0},{"$f":"ROUND(SUM('Contabilità per CDC - SOMED'!U19,'Contabilità per CDC - SOMED'!V19,'Contabilità per CDC - SOMED'!W19),0)","v":0},{"$f":"ROUND('Contabilità per CDC - SOMED'!X19,0)","v":0},{"$f":"ROUND('Contabilità per CDC - SOMED'!Z19,0)","v":0},{"$f":"ROUND('Contabilità per CDC - SOMED'!Y19,0)","v":0},null,"E5.35.",{"$f":"ROUND(SUM('Contabilità per CDC - SOMED'!AB19:AC19),0)","v":0}]
[37,37,"Oneri sociali",null,"E0.37.01",{"$f":"ROUND('Contabilità per CDC - SOMED'!Q22,0)","v":371381},"E0.37.160",{"$f":"ROUND('Contabilità per CDC - SOMED'!AH22,0)","v":0},null,"E1.37",675613,{"$f":"ROUND('Contabilità per CDC - SOMED'!R22,0)","v":0},{"$f":"ROUND('Contabilità per CDC - SOMED'!S22,0)","v":49828},{"$f":"ROUND('Contabilità per CDC - SOMED'!T22*'Contabilità per UFI 1'!E22,0)","v":5958},{"$f":"ROUND('Contabilità per CDC - SOMED'!T22*'Contabilità per UFI 1'!G22,0)","v":589847},{"$f":"ROUND(SUM('Contabilità per CDC - SOMED'!U22,'Contabilità per CDC - SOMED'!V22,'Contabilità per CDC - SOMED'!W22),0)","v":25385},{"$f":"ROUND('Contabilità per CDC - SOMED'!X22,0)","v":4595},{"$f":"ROUND('Contabilità per CDC - SOMED'!Z22,0)","v":0},{"$f":"ROUND('Contabilità per CDC - SOMED'!Y22,0)","v":0},null,"E5.37.",{"$f":"ROUND(SUM('Contabilità per CDC - SOMED'!AB22:AC22),0)","v":281419}]
[38,38,"Onorari per prestazioni di terzi (medici)",null,"E0.38.01",{"$f":"ROUND('Contabilità per CDC - SOMED'!Q24,0)","v":0},"E0.38.160",{"$f":"ROUND('Contabilità per CDC - SOMED'!AH24,0)","v":0},null,"E1.38",25000,{"$f":"ROUND('Contabilità per CDC - SOMED'!R24,0)","v":0},{"$f":"ROUND('Contabilità per CDC - SOMED'!S24,0)","v":0},{"$f":"ROUND('Contabilità per CDC - SOMED'!T24*'Contabilità per UFI 1'!E24,0)","v":25000},{"$f":"ROUND('Contabilità per CDC - SOMED'!T24*'Contabilità per UFI 1'!G24,0)","v":0},{"$f":"ROUND(SUM('Contabilità per CDC - SOMED'!U24,'Contabilità per CDC - SOMED'!V24,'Contabilità per CDC - SOMED'!W24),0)","v":0},{"$f":"ROUND('Contabilità per CDC - SOMED'!X24,0)","v":0},{"$f":"ROUND('Contabilità per CDC - SOMED'!Z24,0)","v":0},{"$f":"ROUND('Contabilità per CDC - SOMED'!Y24,0)","v":0},null,"E5.38.",{"$f":"ROUND(SUM('Contabilità per CDC - SOMED'!AB24:AC24),0)","v":0}]
[39,39,"Costi accessori per il personale",null,"E0.39.01",{"$f":"ROUND('Contabilità per CDC - SOMED'!Q25,0)","v":2500},"E0.39.160",{"$f":"ROUND('Contabilità per CDC - SOMED'!AH25,0)","v":0},null,"E1.39",35500,{"$f":"ROUND('Contabilità per CDC - SOMED'!R25,0)","v":0},{"$f":"ROUND('Contabilità per CDC - SOMED'!S25,0)","v":500},{"$f":"ROUND('Contabilità per CDC - SOMED'!T25*'Contabilità per UFI 1'!E25,0)","v":34000},{"$f":"ROUND('Contabilità per CDC - SOMED'!T25*'Contabilità per UFI 1'!G25,0)","v":0},{"$f":"ROUND(SUM('Contabilità per CDC - SOMED'!U25,'Contabilità per CDC - SOMED'!V25,'Contabilità per CDC - SOMED'!W25),0)","v":1000},{"$f":"ROUND('Contabilità per CDC - SOMED'!X25,0)","v":0},{"$f":"ROUND('Contabilità per CDC - SOMED'!Z25,0)","v":0},{"$f":"ROUND('Contabilità per CDC - SOMED'!Y25,0)","v":0},null,"E5.39.",{"$f":"ROUND(SUM('Contabilità per CDC - SOMED'!AB25:AC25),0)","v":0}]
[40,40,"Costi del fabbisogno medico",null,"E0.40.01",{"$f":"ROUND('Contabilità per CDC - SOMED'!Q26,0)","v":10000},"E0.40.160",{"$f":"ROUND('Contabilità per CDC - SOMED'!AH26,0)","v":0},null,"E1.40",135100,{"$f":"ROUND('Contabilità per CDC - SOMED'!R26,0)","v":0},{"$f":"ROUND('Contabilità per CDC - SOMED'!S26,0)","v":0},{"$f":"ROUND('Contabilità per CDC - SOMED'!T26*'Contabilità per UFI 1'!E26,0)","v":0},{"$f":"ROUND('Contabilità per CDC - SOMED'!T26*'Contabilità per UFI 1'!G26,0)","v":0},{"$f":"ROUND(SUM('Contabilità per CDC - SOMED'!U26,'Contabilità per CDC - SOMED'!V26,'Contabilità per CDC - SOMED'!W26),0)","v":0},{"$f":"ROUND('Contabilità per CDC - SOMED'!X26,0)","v":100},{"$f":"ROUND('Contabilità per CDC - SOMED'!Z26,0)","v":75000},{"$f":"ROUND('Contabilità per CDC - SOMED'!Y26,0)","v":60000},null,"E5.40.",{"$f":"ROUND(SUM('Contabilità per CDC - SOMED'!AB26:AC26),0)","v":25000}]
[41,41,"Costi dei generi alimentari",null,"E0.41.01",{"$f":"ROUND('Contabilità per CDC - SOMED'!Q27,0)","v":250000},"E0.41.160",{"$f":"ROUND('Contabilità per CDC - SOMED'!AH27,0)","v":0},null,"E1.41",0,{"$f":"ROUND('Contabilità per CDC - SOMED'!R27,0)","v":0},{"$f":"ROUND('Contabilità per CDC - SOMED'!S27,0)","v":0},{"$f":"ROUND('Contabilità per CDC - SOMED'!T27*'Contabilità per UFI 1'!E27,0)","v":0},{"$f":"ROUND('Contabilità per CDC - SOMED'!T27*'Contabilità per UFI 1'!G27,0)","v":0},{"$f":"ROUND(SUM('Contabilità per CDC - SOMED'!U27,'Contabilità per CDC - SOMED'!V27,'Contabilità per CDC - SOMED'!W27),0)","v":0},{"$f":"ROUND('Contabilità per CDC - SOMED'!X27,0)","v":0},{"$f":"ROUND('Contabilità per CDC - SOMED'!Z27,0)","v":0},{"$f":"ROUND('Contabilità per CDC - SOMED'!Y27,0)","v":0},null,"E5.41.",{"$f":"ROUND(SUM('Contabilità per CDC - SOMED'!AB27:AC27),0)","v":0}]
[42,42,"Costi di economia domestica",null,"E0.42.01",{"$f":"ROUND('Contabilità per CDC - SOMED'!Q28,0)","v":96200},"E0.42.160",{"$f":"ROUND('Contabilità per CDC - SOMED'!AH28,0)","v":0},null,"E1.42",29000,{"$f":"ROUND('Contabilità per CDC - SOMED'!R28,0)","v":25000},{"$f":"ROUND('Contabilità per CDC - SOMED'!S28,0)","v":500},{"$f":"ROUND('Contabilità per CDC - SOMED'!T28*'Contabilità per UFI 1'!E28,0)","v":3000},{"$f":"ROUND('Contabilità per CDC - SOMED'!T28*'Contabilità per UFI 1'!G28,0)","v":0},{"$f":"ROUND(SUM('Contabilità per CDC - SOMED'!U28,'Contabilità per CDC - SOMED'!V28,'Contabilità per CDC - SOMED'!W28),0)","v":500},{"$f":"ROUND('Contabilità per CDC - SOMED'!X28,0)","v":0},{"$f":"ROUND('Contabilità per CDC - SOMED'!Z28,0)","v":0},{"$f":"ROUND('Contabilità per CDC - SOMED'!Y28,0)","v":0},null,"E5.42.",{"$f":"ROUND(SUM('Contabilità per CDC - SOMED'!AB28:AC28),0)","v":1000}]
[43,43,"Costi di manutenzione e riparazione",null,"E0.43.01",{"$f":"ROUND('Contabilità per CDC - SOMED'!Q29,0)","v":142500},"E0.43.160",{"$f":"ROUND('Contabilità per CDC - SOMED'!AH29,0)","v":0},null,"E1.43",10400,{"$f":"ROUND('Contabilità per CDC - SOMED'!R29,0)","v":2000},{"$f":"ROUND('Contabilità per CDC - SOMED'!S29,0)","v":100},{"$f":"ROUND('Contabilità per CDC - SOMED'!T29*'Contabilità per UFI 1'!E29,0)","v":8000},{"$f":"ROUND('Contabilità per CDC - SOMED'!T29*'Contabilità per UFI 1'!G29,0)","v":0},{"$f":"ROUND(SUM('Contabilità per CDC - SOMED'!U29,'Contabilità per CDC - SOMED'!V29,'Contabilità per CDC - SOMED'!W29),0)","v":300},{"$f":"ROUND('Contabilità per CDC - SOMED'!X29,0)","v":0},{"$f":"ROUND('Contabilità per CDC - SOMED'!Z29,0)","v":0},{"$f":"ROUND('Contabilità per CDC - SOMED'!Y29,0)","v":0},null,"E5.43.",{"$f":"ROUND(SUM('Contabilità per CDC - SOMED'!AB29:AC29),0)","v":0}]
["440+443+444",44,"Acquisti direttamente ammortizzati",null,"E0.44.01",{"$f":"ROUND(SUM('Contabilità per CDC - SOMED'!Q30,'Contabilità per CDC - SOMED'!Q32,'Contabilità per CDC - SOMED'!Q33),0)","v":43900},"E0.44.160",{"$f":"ROUND(SUM('Contabilità per CDC - SOMED'!AH30,'Contabilità per CDC - SOMED'!AH32,'Contabilità per CDC - SOMED'!AH33),0)","v":0},null,"E1.44",15600,{"$f":"ROUND(SUM('Contabilità per CDC - SOMED'!R30,'Contabilità per CDC - SOMED'!R32,'Contabilità per CDC - SOMED'!R33),0)","v":5000},{"$f":"ROUND(SUM('Contabilità per CDC - SOMED'!S30,'Contabilità per CDC - SOMED'!S32,'Contabilità per CDC - SOMED'!S33),0)","v":100},{"$f":"ROUND(SUM('Contabilità per CDC - SOMED'!T30,'Contabilità per CDC - SOMED'!T32,'Contabilità per CDC - SOMED'!T33)*'Contabilità per UFI 1'!E30,0)","v":9500},{"$f":"ROUND(SUM('Contabilità per CDC - SOMED'!T30,'Contabilità per CDC - SOMED'!T32,'Contabilità per CDC - SOMED'!T33)*'Contabilità per UFI 1'!G30,0)","v":0},{"$f":"ROUND(SUM('Contabilità per CDC - SOMED'!U30,'Contabilità per CDC - SOMED'!U32,'Contabilità per CDC - SOMED'!U33,'Contabilità per CDC - SOMED'!V30,'Contabilità per CDC - SOMED'!V32,'Contabilità per CDC - SOMED'!V33,'Contabilità per CDC - SOMED'!W30,'Contabilità per CDC - SOMED'!W32,'Contabilità per CDC - SOMED'!W33),0)","v":1000},{"$f":"ROUND(SUM('Contabilità per CDC - SOMED'!X30,'Contabilità per CDC - SOMED'!X32,'Contabilità per CDC - SOMED'!X33),0)","v":0},{"$f":"ROUND(SUM('Contabilità per CDC - SOMED'!Z30,'Contabilità per CDC - SOMED'!Z32,'Contabilità per CDC - SOMED'!Z33),0)","v":0},{"$f":"ROUND(SUM('Contabilità per CDC - SOMED'!Y30,'Contabilità per CDC - SOMED'!Y32,'Contabilità per CDC - SOMED'!Y33),0)","v":0},null,"E5.44.",{"$f":"ROUND(SUM('Contabilità per CDC - SOMED'!AB30:AC30,'Contabilità per CDC - SOMED'!AB32:AC32,'Contabilità per CDC - SOMED'!AB33:AC33),0)","v":0}]
[442,442,"Ammortamenti ",null,"E0.442.01",{"$f":"ROUND('Contabilità per CDC - SOMED'!Q31,0)","v":796135},"E0.442.160",{"$f":"ROUND('Contabilità per CDC - SOMED'!AH31,0)","v":0},null,"E1.442",17704,{"$f":"ROUND('Contabilità per CDC - SOMED'!R31,0)","v":15208},{"$f":"ROUND('Contabilità per CDC - SOMED'!S31,0)","v":2121},{"$f":"ROUND('Contabilità per CDC - SOMED'!T31*'Contabilità per UFI 1'!E31,0)","v":0},{"$f":"ROUND('Contabilità per CDC - SOMED'!T31*'Contabilità per UFI 1'!G31,0)","v":0},{"$f":"ROUND(SUM('Contabilità per CDC - SOMED'!U31,'Contabilità per CDC - SOMED'!V31,'Contabilità per CDC - SOMED'!W31),0)","v":375},{"$f":"ROUND('Contabilità per CDC - SOMED'!X31,0)","v":0},{"$f":"ROUND('Contabilità per CDC - SOMED'!Z31,0)","v":0},{"$f":"ROUND('Contabilità per CDC - SOMED'!Y31,0)","v":0},null,"E5.442.",{"$f":"ROUND(SUM('Contabilità per CDC - SOMED'!AB31:AC31),0)","v":0}]
[45,45,"Costi per energia e acqua",null,"E0.45.01",{"$f":"ROUND('Contabilità per CDC - SOMED'!Q35,0)","v":116300},"E0.45.160",{"$f":"ROUND('Contabilità per CDC - SOMED'!AH35,0)","v":0},null,"E1.45",0,{"$f":"ROUND('Contabilità per CDC - SOMED'!R35,0)","v":0},{"$f":"ROUND('Contabilità per CDC - SOMED'!S35,0)","v":0},{"$f":"ROUND('Contabilità per CDC - SOMED'!T35*'Contabilità per UFI 1'!E35,0)","v":0},{"$f":"ROUND('Contabilità per CDC - SOMED'!T35*'Contabilità per UFI 1'!G35,0)","v":0},{"$f":"ROUND(SUM('Contabilità per CDC - SOMED'!U35,'Contabilità per CDC - SOMED'!V35,'Contabilità per CDC - SOMED'!W35),0)","v":0},{"$f":"ROUND('Contabilità per CDC - SOMED'!X35,0)","v":0},{"$f":"ROUND('Contabilità per CDC - SOMED'!Z35,0)","v":0},{"$f":"ROUND('Contabilità per CDC - SOMED'!Y35,0)","v":0},null,"E5.45.",{"$f":"ROUND(SUM('Contabilità per CDC - SOMED'!AB35:AC35),0)","v":0}]
["448 (+46)",46,"Costi per interessi di capitale",null,"E0.46.01",{"$f":"ROUND(SUM('Contabilità per CDC - SOMED'!Q34,'Contabilità per CDC - SOMED'!Q36),0)","v":577311},"E0.46.160",{"$f":"ROUND(SUM('Contabilità per CDC - SOMED'!AH34,'Contabilità per CDC - SOMED'!AH36),0)","v":0},null,"E1.46",4003,{"$f":"ROUND(SUM('Contabilità per CDC - SOMED'!R34,'Contabilità per CDC - SOMED'!R36),0)","v":2652},{"$f":"ROUND(SUM('Contabilità per CDC - SOMED'!S34,'Contabilità per CDC - SOMED'!S36),0)","v":1295},{"$f":"ROUND(SUM('Contabilità per CDC - SOMED'!T34,'Contabilità per CDC - SOMED'!T36)*'Contabilità per UFI 1'!E34,0)","v":0},{"$f":"ROUND(SUM('Contabilità per CDC - SOMED'!T34,'Contabilità per CDC - SOMED'!T36)*'Contabilità per UFI 1'!G34,0)","v":0},{"$f":"ROUND(SUM('Contabilità per CDC - SOMED'!U34,'Contabilità per CDC - SOMED'!U36,'Contabilità per CDC - SOMED'!V34,'Contabilità per CDC - SOMED'!V36,'Contabilità per CDC - SOMED'!W34,'Contabilità per CDC - SOMED'!W36),0)","v":56},{"$f":"ROUND(SUM('Contabilità per CDC - SOMED'!X34,'Contabilità per CDC - SOMED'!X36),0)","v":0},{"$f":"ROUND(SUM('Contabilità per CDC - SOMED'!Z34,'Contabilità per CDC - SOMED'!Z36),0)","v":0},{"$f":"ROUND(SUM('Contabilità per CDC - SOMED'!Y34,'Contabilità per CDC - SOMED'!Y36),0)","v":0},null,"E5.46.",{"$f":"ROUND(SUM('Contabilità per CDC - SOMED'!AB34:AC34,'Contabilità per CDC - SOMED'!AB36:AC36),0)","v":0}]
[47,47,"Costi di ufficio, amministrativi e informatica",null,"E0.47.01",{"$f":"ROUND('Contabilità per CDC - SOMED'!Q37,0)","v":65500},"E0.47.160",{"$f":"ROUND('Contabilità per CDC - SOMED'!AH37,0)","v":0},null,"E1.47",1000,{"$f":"ROUND('Contabilità per CDC - SOMED'!R37,0)","v":0},{"$f":"ROUND('Contabilità per CDC - SOMED'!S37,0)","v":0},{"$f":"ROUND('Contabilità per CDC - SOMED'!T37*'Contabilità per UFI 1'!E37,0)","v":500},{"$f":"ROUND('Contabilità per CDC - SOMED'!T37*'Contabilità per UFI 1'!G37,0)","v":0},{"$f":"ROUND(SUM('Contabilità per CDC - SOMED'!U37,'Contabilità per CDC - SOMED'!V37,'Contabilità per CDC - SOMED'!W37),0)","v":500},{"$f":"ROUND('Contabilità per CDC - SOMED'!X37,0)","v":0},{"$f":"ROUND('Contabilità per CDC - SOMED'!Z37,0)","v":0},{"$f":"ROUND('Contabilità per CDC - SOMED'!Y37,0)","v":0},null,"E5.47.",{"$f":"ROUND(SUM('Contabilità per CDC - SOMED'!AB37:AC37),0)","v":0}]
[48,48,"Altri costi relativi ai residenti",null,"E0.48.01",{"$f":"ROUND('Contabilità per CDC - SOMED'!Q38,0)","v":2100},"E0.48.160",{"$f":"ROUND('Contabilità per CDC - SOMED'!AH38,0)","v":0},null,"E1.48",8000,{"$f":"ROUND('Contabilità per CDC - SOMED'!R38,0)","v":6500},{"$f":"ROUND('Contabilità per CDC - SOMED'!S38,0)","v":1500},{"$f":"ROUND('Contabilità per CDC - SOMED'!T38*'Contabilità per UFI 1'!E38,0)","v":0},{"$f":"ROUND('Contabilità per CDC - SOMED'!T38*'Contabilità per UFI 1'!G38,0)","v":0},{"$f":"ROUND(SUM('Contabilità per CDC - SOMED'!U38,'Contabilità per CDC - SOMED'!V38,'Contabilità per CDC - SOMED'!W38),0)","v":0},{"$f":"ROUND('Contabilità per CDC - SOMED'!X38,0)","v":0},{"$f":"ROUND('Contabilità per CDC - SOMED'!Z38,0)","v":0},{"$f":"ROUND('Contabilità per CDC - SOMED'!Y38,0)","v":0},null,"E5.48.",{"$f":"ROUND(SUM('Contabilità per CDC - SOMED'!AB38:AC38),0)","v":0}]
[49,49,"Altri costi d'esercizio (non relativi ai residenti)",null,"E0.49.01",{"$f":"ROUND('Contabilità per CDC - SOMED'!Q39,0)","v":42000},"E0.49.160",{"$f":"ROUND('Contabilità per CDC - SOMED'!AH39,0)","v":0},null,"E1.49",10500,{"$f":"ROUND('Contabilità per CDC - SOMED'!R39,0)","v":0},{"$f":"ROUND('Contabilità per CDC - SOMED'!S39,0)","v":4500},{"$f":"ROUND('Contabilità per CDC - SOMED'!T39*'Contabilità per UFI 1'!E39,0)","v":5500},{"$f":"ROUND('Contabilità per CDC - SOMED'!T39*'Contabilità per UFI 1'!G39,0)","v":0},{"$f":"ROUND(SUM('Contabilità per CDC - SOMED'!U39,'Contabilità per CDC - SOMED'!V39,'Contabilità per CDC - SOMED'!W39),0)","v":500},{"$f":"ROUND('Contabilità per CDC - SOMED'!X39,0)","v":0},{"$f":"ROUND('Contabilità per CDC - SOMED'!Z39,0)","v":0},{"$f":"ROUND('Contabilità per CDC - SOMED'!Y39,0)","v":0},null,"E5.49.",{"$f":"ROUND(SUM('Contabilità per CDC - SOMED'!AB39:AC39),0)","v":0}]
[null,"100","Costi lordi prima delle ripartizioni",null,"E0.100.01",{"$f":"SUM(F9:F30)","v":4132427},"E0.100.160",{"$f":"SUM(H9:H30)","v":0},null,"E1.100.01",{"$f":"SUM(K9:K30)","v":3958320},{"$f":"SUM(L9:L30)","v":56360},{"$f":"SUM(M9:M30)","v":277344},{"$f":"SUM(N9:N30)","v":152683},3172122,{"$f":"SUM(P9:P30)","v":140116},{"$f":"SUM(Q9:Q30)","v":24695},{"$f":"SUM(R9:R30)","v":75000},{"$f":"SUM(S9:S30)","v":60000},null,"E5.100.05",{"$f":"SUM(V9:V30)","v":1652419}]
["Riduzione dei costi, ricavi accessori compresi"]
[65,"n.p.","Altri ricavi da prestazioni ai residenti",null,"( 65 )",{"$f":"ROUND('Contabilità per CDC - SOMED'!Q42,0)","v":-13560},"(65)",{"$f":"ROUND('Contabilità per CDC - SOMED'!AH42,0)","v":0},null,"(65)",{"$f":"SUM(L33:S33)","v":-4800},{"$f":"ROUND('Contabilità per CDC - SOMED'!R42,0)","v":-800},{"$f":"ROUND('Contabilità per CDC - SOMED'!S42,0)","v":-4000},{"$f":"ROUND('Contabilità per CDC - SOMED'!T42*'Contabilità per UFI 1'!E42,0)","v":0},{"$f":"ROUND('Contabilità per CDC - SOMED'!T42*'Contabilità per UFI 1'!G42,0)","v":0},{"$f":"ROUND(SUM('Contabilità per CDC - SOMED'!U42,'Contabilità per CDC - SOMED'!V42,'Contabilità per CDC - SOMED'!W42),0)","v":0},{"$f":"ROUND('Contabilità per CDC - SOMED'!X42,0)","v":0},{"$f":"ROUND('Contabilità per CDC - SOMED'!Z42,0)","v":0},{"$f":"ROUND('Contabilità per CDC - SOMED'!Y42,0)","v":0},null,"(65)",{"$f":"ROUND(SUM('Contabilità per CDC - SOMED'!AB42:AC42),0)","v":0}]
[66,"n.p.","Ricavi finanziari - tralasciati per SOMED ",null,"( 66 )",null,"(66)",null,null,"(66)",null,null,null,null,null,null,null,null,null,null,"(66)"]
[68,"n.p.","Ricavi da prestazioni al personale e a terzi",null,"( 68 )",{"$f":"ROUND('Contabilità per CDC - SOMED'!Q44,0)","v":-550},"(68)",{"$f":"ROUND('Contabilità per CDC - SOMED'!AH44,0)","v":0},null,"(68)",{"$f":"SUM(L35:S35)","v":0},{"$f":"ROUND('Contabilità per CDC - SOMED'!R44,0)","v":0},{"$f":"ROUND('Contabilità per CDC - SOMED'!S44,0)","v":0},{"$f":"ROUND('Contabilità per CDC - SOMED'!T44*'Contabilità per UFI 1'!E44,0)","v":0},{"$f":"ROUND('Contabilità per CDC - SOMED'!T44*'Contabilità per UFI 1'!G44,0)","v":0},{"$f":"ROUND(SUM('Contabilità per CDC - SOMED'!U44,'Contabilità per CDC - SOMED'!V44,'Contabilità per CDC - SOMED'!W44),0)","v":0},{"$f":"ROUND('Contabilità per CDC - SOMED'!X44,0)","v":0},{"$f":"ROUND('Contabilità per CDC - SOMED'!Z44,0)","v":0},{"$f":"ROUND('Contabilità per CDC - SOMED'!Y44,0)","v":0},null,"(68)",{"$f":"ROUND(SUM('Contabilità per CDC - SOMED'!AB44:AC44),0)","v":0}]
[7,"n.p.","Riduzione dei costi generali imputati su CdC NON SOMED",null,"( EX 7 )",{"$f":"ROUND('Contabilità per CDC - SOMED'!Q45,0)","v":-65390},"(EX 7)",null,null,"(EX 7)",null,null,null,null,null,null,null,null,null,null,"(EX 7)"]
[null,"200","Costi netti prima delle ripartizioni",null,"E0.200.01",{"$f":"SUM(F33:F36)+F31","v":4052927},"E0.200.160",{"$f":"SUM(H33:H36)+H31","v":0},null,"E1.200.01",{"$f":"SUM(K33:K36)+K31","v":3953520},55560,273344,152683,3172122,140116,24695,75000,60000,null,"E5.200.05",{"$f":"SUM(V33:V36)+V31","v":1652419}]
[]
["Ripartizioni sui centri di costo generali e principali",null,null,null,null,null,"Ripartizione sui CdC generali e principali"]
["RIP010","n.p.","Ripartizione Edifici",null,null,null,"( RIP010 )",{"$f":"ROUND('Contabilità per CDC - SOMED'!AH48,0)","v":0},null,"( RIP010 )",{"$f":"SUM(L40:S40)","v":872595},{"$f":"ROUND('Contabilità per CDC - SOMED'!R48,0)","v":773577},{"$f":"ROUND('Contabilità per CDC - SOMED'!S48,0)","v":37132},{"$f":"ROUND('Contabilità per CDC - SOMED'!T48*'Contabilità per UFI 1'!E48,0)","v":30943},{"$f":"ROUND('Contabilità per CDC - SOMED'!T48*'Contabilità per UFI 1'!G48,0)","v":0},{"$f":"ROUND(SUM('Contabilità per CDC - SOMED'!U48,'Contabilità per CDC - SOMED'!V48,'Contabilità per CDC - SOMED'!W48),0)","v":27849},{"$f":"ROUND('Contabilità per CDC - SOMED'!X48,0)","v":0},{"$f":"ROUND('Contabilità per CDC - SOMED'!Z48,0)","v":3094},{"$f":"ROUND('Contabilità per CDC - SOMED'!Y48,0)","v":0},null,"( RIP010 )",{"$f":"ROUND('Contabilità per CDC - SOMED'!AB48,0)","v":263016}]
["RIP011","n.p.","Ripartizione Energia",null,null,null,"( RIP011 )",{"$f":"ROUND('Contabilità per CDC - SOMED'!AH49,0)","v":0},null,"( RIP011 )",{"$f":"SUM(L41:S41)","v":98906},{"$f":"ROUND('Contabilità per CDC - SOMED'!R49,0)","v":87682},{"$f":"ROUND('Contabilità per CDC - SOMED'!S49,0)","v":4209},{"$f":"ROUND('Contabilità per CDC - SOMED'!T49*'Contabilità per UFI 1'!E49,0)","v":3507},{"$f":"ROUND('Contabilità per CDC - SOMED'!T49*'Contabilità per UFI 1'!G49,0)","v":0},{"$f":"ROUND(SUM('Contabilità per CDC - SOMED'!U49,'Contabilità per CDC - SOMED'!V49,'Contabilità per CDC - SOMED'!W49),0)","v":3157},{"$f":"ROUND('Contabilità per CDC - SOMED'!X49,0)","v":0},{"$f":"ROUND('Contabilità per CDC - SOMED'!Z49,0)","v":351},{"$f":"ROUND('Contabilità per CDC - SOMED'!Y49,0)","v":0},null,"( RIP011 )",{"$f":"ROUND('Contabilità per CDC - SOMED'!AB49,0)","v":29812}]
["RIP020","n.p.","Ripartizione Servizi tecnici",null,null,null,"( RIP020 )",{"$f":"ROUND('Contabilità per CDC - SOMED'!AH50,0)","v":0},null,"( RIP020 )",92077,{"$f":"ROUND('Contabilità per CDC - SOMED'!R50,0)","v":81628},{"$f":"ROUND('Contabilità per CDC - SOMED'!S50,0)","v":3918},{"$f":"ROUND('Contabilità per CDC - SOMED'!T50*'Contabilità per UFI 1'!E50,0)","v":3265},{"$f":"ROUND('Contabilità per CDC - SOMED'!T50*'Contabilità per UFI 1'!G50,0)","v":0},{"$f":"ROUND(SUM('Contabilità per CDC - SOMED'!U50,'Contabilità per CDC - SOMED'!V50,'Contabilità per CDC - SOMED'!W50),0)","v":2939},{"$f":"ROUND('Contabilità per CDC - SOMED'!X50,0)","v":0},{"$f":"ROUND('Contabilità per CDC - SOMED'!Z50,0)","v":327},{"$f":"ROUND('Contabilità per CDC - SOMED'!Y50,0)","v":0},null,"( RIP020 )",{"$f":"ROUND('Contabilità per CDC - SOMED'!AB50,0)","v":27753}]
["RIP021","n.p.","Ripartizione Servizio trasporti",null,null,null,"( RIP021 )",{"$f":"ROUND('Contabilità per CDC - SOMED'!AH51,0)","v":0},null,"( RIP021 )",4016,{"$f":"ROUND('Contabilità per CDC - SOMED'!R51,0)","v":0},{"$f":"ROUND('Contabilità per CDC - SOMED'!S51,0)","v":927},{"$f":"ROUND('Contabilità per CDC - SOMED'!T51*'Contabilità per UFI 1'!E51,0)","v":3089},{"$f":"ROUND('Contabilità per CDC - SOMED'!T51*'Contabilità per UFI 1'!G51,0)","v":0},{"$f":"ROUND(SUM('Contabilità per CDC - SOMED'!U51,'Contabilità per CDC - SOMED'!V51,'Contabilità per CDC - SOMED'!W51),0)","v":0},{"$f":"ROUND('Contabilità per CDC - SOMED'!X51,0)","v":0},{"$f":"ROUND('Contabilità per CDC - SOMED'!Z51,0)","v":0},{"$f":"ROUND('Contabilità per CDC - SOMED'!Y51,0)","v":0},null,"( RIP021 )",{"$f":"ROUND('Contabilità per CDC - SOMED'!AB51,0)","v":0}]
["RIP030","n.p.","Ripartizione Direzione / Amministrazione",null,null,null,"( RIP030 )",{"$f":"ROUND('Contabilità per CDC - SOMED'!AH52,0)","v":0},null,"( RIP030 )",338021,{"$f":"ROUND('Contabilità per CDC - SOMED'!R52,0)","v":0},{"$f":"ROUND('Contabilità per CDC - SOMED'!S52,0)","v":24930},{"$f":"ROUND('Contabilità per CDC - SOMED'!T52*'Contabilità per UFI 1'!E52,0)","v":298091},{"$f":"ROUND('Contabilità per CDC - SOMED'!T52*'Contabilità per UFI 1'!G52,0)","v":0},{"$f":"ROUND(SUM('Contabilità per CDC - SOMED'!U52,'Contabilità per CDC - SOMED'!V52,'Contabilità per CDC - SOMED'!W52),0)","v":12701},{"$f":"ROUND('Contabilità per CDC - SOMED'!X52,0)","v":2299},{"$f":"ROUND('Contabilità per CDC - SOMED'!Z52,0)","v":0},{"$f":"ROUND('Contabilità per CDC - SOMED'!Y52,0)","v":0},null,"( RIP030 )",{"$f":"ROUND('Contabilità per CDC - SOMED'!AB52,0)","v":140799}]
["RIP040","n.p.","Ripartizione Economia domestica in generale",null,null,null,"( RIP040 )",{"$f":"ROUND('Contabilità per CDC - SOMED'!AH53,0)","v":0},null,"( RIP040 )",62338,{"$f":"ROUND('Contabilità per CDC - SOMED'!R53,0)","v":0},{"$f":"ROUND('Contabilità per CDC - SOMED'!S53,0)","v":4598},{"$f":"ROUND('Contabilità per CDC - SOMED'!T53*'Contabilità per UFI 1'!E53,0)","v":54974},{"$f":"ROUND('Contabilità per CDC - SOMED'!T53*'Contabilità per UFI 1'!G53,0)","v":0},{"$f":"ROUND(SUM('Contabilità per CDC - SOMED'!U53,'Contabilità per CDC - SOMED'!V53,'Contabilità per CDC - SOMED'!W53),0)","v":2342},{"$f":"ROUND('Contabilità per CDC - SOMED'!X53,0)","v":424},{"$f":"ROUND('Contabilità per CDC - SOMED'!Z53,0)","v":0},{"$f":"ROUND('Contabilità per CDC - SOMED'!Y53,0)","v":0},null,"( RIP040 )",{"$f":"ROUND('Contabilità per CDC - SOMED'!AB53,0)","v":25966}]
["RIP041","n.p.","Ripartizione Lavanderia",null,null,null,"( RIP041 )",{"$f":"ROUND('Contabilità per CDC - SOMED'!AH54,0)","v":0},null,"( RIP041 )",330027,{"$f":"ROUND('Contabilità per CDC - SOMED'!R54,0)","v":292059},{"$f":"ROUND('Contabilità per CDC - SOMED'!S54,0)","v":2247},{"$f":"ROUND('Contabilità per CDC - SOMED'!T54*'Contabilità per UFI 1'!E54,0)","v":33699},{"$f":"ROUND('Contabilità per CDC - SOMED'!T54*'Contabilità per UFI 1'!G54,0)","v":0},{"$f":"ROUND(SUM('Contabilità per CDC - SOMED'!U54,'Contabilità per CDC - SOMED'!V54,'Contabilità per CDC - SOMED'!W54),0)","v":2022},{"$f":"ROUND('Contabilità per CDC - SOMED'!X54,0)","v":0},{"$f":"ROUND('Contabilità per CDC - SOMED'!Z54,0)","v":0},{"$f":"ROUND('Contabilità per CDC - SOMED'!Y54,0)","v":0},null,"( RIP041 )",{"$f":"ROUND('Contabilità per CDC - SOMED'!AB54,0)","v":96604}]
["RIP042","n.p.","Ripartizione Pulizie",null,null,null,"( RIP042 )",{"$f":"ROUND('Contabilità per CDC - SOMED'!AH55,0)","v":0},null,"( RIP042 )",283039,{"$f":"ROUND('Contabilità per CDC - SOMED'!R55,0)","v":250921},{"$f":"ROUND('Contabilità per CDC - SOMED'!S55,0)","v":12044},{"$f":"ROUND('Contabilità per CDC - SOMED'!T55*'Contabilità per UFI 1'!E55,0)","v":10037},{"$f":"ROUND('Contabilità per CDC - SOMED'!T55*'Contabilità per UFI 1'!G55,0)","v":0},{"$f":"ROUND(SUM('Contabilità per CDC - SOMED'!U55,'Contabilità per CDC - SOMED'!V55,'Contabilità per CDC - SOMED'!W55),0)","v":9033},{"$f":"ROUND('Contabilità per CDC - SOMED'!X55,0)","v":0},{"$f":"ROUND('Contabilità per CDC - SOMED'!Z55,0)","v":1004},{"$f":"ROUND('Contabilità per CDC - SOMED'!Y55,0)","v":0},null,"( RIP042 )",{"$f":"ROUND('Contabilità per CDC - SOMED'!AB55,0)","v":85313}]
["RIP060","n.p.","Ripartizione Cucina",null,null,null,"( RIP060 )",{"$f":"ROUND('Contabilità per CDC - SOMED'!AH56,0)","v":0},null,"( RIP060 )",1107576,{"$f":"ROUND('Contabilità per CDC - SOMED'!R56,0)","v":1107576},{"$f":"ROUND('Contabilità per CDC - SOMED'!S56,0)","v":0},{"$f":"ROUND('Contabilità per CDC - SOMED'!T56*'Contabilità per UFI 1'!E56,0)","v":0},{"$f":"ROUND('Contabilità per CDC - SOMED'!T56*'Contabilità per UFI 1'!G56,0)","v":0},{"$f":"ROUND(SUM('Contabilità per CDC - SOMED'!U56,'Contabilità per CDC - SOMED'!V56,'Contabilità per CDC - SOMED'!W56),0)","v":0},{"$f":"ROUND('Contabilità per CDC - SOMED'!X56,0)","v":0},{"$f":"ROUND('Contabilità per CDC - SOMED'!Z56,0)","v":0},{"$f":"ROUND('Contabilità per CDC - SOMED'!Y56,0)","v":0},null,"( RIP060 )",{"$f":"ROUND('Contabilità per CDC - SOMED'!AB56,0)","v":170000}]
["RIP090","n.p.","Ripartizione Magazzino centrale",null,null,null,"( RIP090 )",{"$f":"ROUND('Contabilità per CDC - SOMED'!AH57,0)","v":0},null,"( RIP090 )",0,{"$f":"ROUND('Contabilità per CDC - SOMED'!R57,0)","v":0},{"$f":"ROUND('Contabilità per CDC - SOMED'!S57,0)","v":0},{"$f":"ROUND('Contabilità per CDC - SOMED'!T57*'Contabilità per UFI 1'!E57,0)","v":0},{"$f":"ROUND('Contabilità per CDC - SOMED'!T57*'Contabilità per UFI 1'!G57,0)","v":0},{"$f":"ROUND(SUM('Contabilità per CDC - SOMED'!U57,'Contabilità per CDC - SOMED'!V57,'Contabilità per CDC - SOMED'!W57),0)","v":0},{"$f":"ROUND('Contabilità per CDC - SOMED'!X57,0)","v":0},{"$f":"ROUND('Contabilità per CDC - SOMED'!Z57,0)","v":0},{"$f":"ROUND('Contabilità per CDC - SOMED'!Y57,0)","v":0},null,"( RIP090 )",{"$f":"ROUND('Contabilità per CDC - SOMED'!AB57,0)","v":0}]
["RIP095","n.p.","Ripartizione Farmacia",null,null,null,"( RIP095 )",{"$f":"ROUND('Contabilità per CDC - SOMED'!AH58,0)","v":0},null,"( RIP095 )",18003,{"$f":"ROUND('Contabilità per CDC - SOMED'!R58,0)","v":0},{"$f":"ROUND('Contabilità per CDC - SOMED'!S58,0)","v":0},{"$f":"ROUND('Contabilità per CDC - SOMED'!T58*'Contabilità per UFI 1'!E58,0)","v":0},{"$f":"ROUND('Contabilità per CDC - SOMED'!T58*'Contabilità per UFI 1'!G58,0)","v":0},{"$f":"ROUND(SUM('Contabilità per CDC - SOMED'!U58,'Contabilità per CDC - SOMED'!V58,'Contabilità per CDC - SOMED'!W58),0)","v":0},{"$f":"ROUND('Contabilità per CDC - SOMED'!X58,0)","v":0},{"$f":"ROUND('Contabilità per CDC - SOMED'!Z58,0)","v":10002},{"$f":"ROUND('Contabilità per CDC - SOMED'!Y58,0)","v":8001},null,"( RIP095 )",{"$f":"ROUND('Contabilità per CDC - SOMED'!AB58,0)","v":7068}]
[null,"300","Costi netti dopo ripartizioni ",null,null,null,"E0.300.160",{"$f":"H37+SUM(H40:H50)","v":0},null,"E1.300.01",{"$f":"SUM(K37:K50)","v":7160118},{"$f":"SUM(L37:L50)","v":2649003},363349,590288,3172122,200159,27418,89778,68001,null,"E5.300.01",{"$f":"V37+SUM(V40:V50)","v":2498750}]
[]
[null,null,null,null,"Stima del Contributo globale (CG) CPA - settore stazionario - Calcolo SOMED-A"]
[null,null,null,null,"Tot. Costi analitici CPA (E1.300.01)",null,{"$f":"+K51","v":7160118}]
[null,null,null,null,"Ricavi analitici CPA (senza Contibuto globale erogato !)",null,null,null,null,"Ricavi E2  (CdC finali della CPA) "]
[null,null,null,null,"Rette CPA (alloggio)","E2.6000",{"$f":"+K59","v":2100000},null,null,"   R i c a v i    t o t a l i    d e i    C d C   f i n a l i    d e l l a    C P A"]
[null,null,null,null,"AGI","E2.6020",{"$f":"+K60","v":315000},null,null,null,"Totale","02. Servizio","03. Assistenza e cura",null,"04. Cura","05. Terapie","06. Medico","07. Medicamenti","08. Materiale "]
["Ricavi","E2 / E6 ",null,null,"Partecipaz. CM cure CPA","E2.6061",{"$f":"+K62","v":1770000},null,null,"E2",null,"alberghiero ","non LAMal",null,"LAMal",null,null,"ES / EMT","EMAp"]
["6000.00+20+30","6000/ 6010","Tasse di alloggio (rette)",null,"Partecipaz. ospiti cure CPA","E2.6062",{"$f":"+K63","v":87500},null,null,"E2.6000.02",{"$f":"SUM(L59:S59)","v":2100000},{"$f":"ROUND(-'Contabilità per CDC - SOMED'!R62,0)","v":2100000}]
["6002.00+10+20","6020/ 6030","Tasse per l'assistenza (AGI)",null,"Rette CDT","E2.6070",{"$f":"+K65","v":0},null,null,"E2.6020.03",{"$f":"SUM(L60:S60)","v":315000},null,{"$f":"ROUND(-'Contabilità per CDC - SOMED'!T64,0)","v":315000}]
[null,"6060/ 6050","Totale tasse di cura",null,"Tot. Ricavi analitici da COIN","E2.69",{"$f":"+G71","v":1402685},null,null,"E2.6060",{"$f":"SUM(L61:S61)","v":3342433},null,null,null,{"$f":"SUM(O62:O64)","v":3052433},{"$f":"SUM(P62:P64)","v":105000},{"$f":"SUM(Q62:Q64)","v":0},{"$f":"SUM(R62:R64)","v":115000},{"$f":"SUM(S62:S64)","v":70000}]
["6001.00+10+20+40+50+60","6061/ 6051","Tasse (partecipazioni) di cura assicuratori malattia",null,"Totale ricavi analitici CPA COAN",null,{"$f":"SUM(G56:G61)","v":5675185},null,null,"E2.6061",{"$f":"SUM(L62:S62)","v":1770000},null,null,null,{"$f":"ROUND(-'Contabilità per CDC - SOMED'!T63,0)","v":1550000},{"$f":"ROUND(SUM(-'Contabilità per CDC - SOMED'!U63,-'Contabilità per CDC - SOMED'!V63,-'Contabilità per CDC - SOMED'!W63),0)","v":105000},{"$f":"ROUND(-'Contabilità per CDC - SOMED'!X63,0)","v":0},{"$f":"ROUND(-SUM('Contabilità per CDC - SOMED'!Z63,'Contabilità per CDC - SOMED'!Z65),0)","v":115000},{"$f":"ROUND(-'Contabilità per CDC - SOMED'!Y63,0)","v":0}]
["6000.10","6062/ 6052","Tasse (partecipazione) di cura LAMal residente ",null,null,null,null,null,null,"E2.6062.04",87500,null,null,null,{"$f":"ROUND(-'Contabilità per CDC - SOMED'!T62,0)","v":87500}]
["6900.00+50","6063/ 6053","Tasse di cura partecipazione Comuni / Cantone (CG annuo)",null,"Deficit d'esercizio CPA (senza CG !)",null,{"$f":"G62-G54","v":-1484933},"> = CG > E2.6063.04+06!",null,"E2.6063.04+08",1484933,null,null,null,{"$f":"ROUND(-G64,0)-S64","v":1414933},null,null,null,{"$f":"ROUND(-'Contabilità per CDC - SOMED'!Y70,0)","v":70000}]
["6000.40",6070,"Tasse utenti strutture diurne o notturne (= CDT)",null,"Deficit d'esercizio CDT (senza CG!)",null,{"$f":"K65-H51","v":0},"> non considerato per SOMED-A!",null,"E2.6070.02",0,{"$f":"ROUND(-SUM('Contabilità per CDC - SOMED'!AH62:AH63),0)","v":0}]
[null,69,"Totale contributi e sovvenzioni",null,"Ricavi analitici da COIN (E4. SOMED-A)",null,null,null,null,"E2.69",{"$f":"SUM(K67:K70)","v":1402685}]
["690",6900,"Contributi e sovvenzioni dei Comuni ",null,"da Comuni ",null,{"$f":"ROUND('Resoconti COIN'!M135,0)","v":146489},"> = E2.6900",null,"E2.6900",{"$f":"ROUND(G67,0)","v":146489}]
["695",6950,"Contributi e sovvenzioni dei Cantoni",null,"da Cantoni",null,{"$f":"ROUND('Resoconti COIN'!M136,0)","v":486115},"> = E2.6950",null,"E2.6950",{"$f":"ROUND(G68,0)","v":486115}]
["6980.20",6960,"Contributi e sovvenzioni della Confederazione",null,"da Confederazione",null,{"$f":"ROUND('Resoconti COIN'!M137,0)","v":234255},"> = E2.6960",null,"E2.6960",{"$f":"ROUND(G69,0)","v":234255},null,null,null,null,null,"Risultato d'esercizio E3 - CPA"]
["697+698",6970,"Contributi e sovvenzioni da Fondazioni, cooperative ecc. ",null,"da Enti privati (+ ev. donazioni dedicate)",null,{"$f":"ROUND('Resoconti COIN'!M138,0)","v":535826},"> = E2.6970",null,"E2.6970",{"$f":"ROUND(G70,0)","v":535826},null,null,null,null,null,"CPA","E3.01",{"$f":"K71-K51","v":0}]
[null,100,"Totale ricavi analitici ",null,"Totale Ricavi analitici COIN",null,{"$f":"ROUND('Resoconti COIN'!M134,0)","v":1402685},"> = TOT. E2.69",null,"E2.100.01",{"$f":"SUM(K59:K61,K65,K66)","v":7160118},null,null,null,null,null,"CDT (non ripreso in SOMED)",null,{"$f":"K65-H51","v":0}]
[]
[null,null,null,null,"Stima del Contributo globale (CG) per Reparto CAT-STT -  Calcolo SOMED-A"]
[null,null,null,null,"Tot. Costi analitici CAT-STT (E5.300.01)",null,{"$f":"+V51","v":2498750},null,null,"Ricavi E6 - Reparto CAT - STT"]
[null,null,null,null,"Ricavi analitici CAT-STT (senza Contibuto globale erogato !)",null,null,null,null,"   R i c a v i    del reparto CAT"]
[null,null,null,null,"Rette CAT-STT","E6.6010",{"$f":"+K78","v":170000},null,null,null,"Totale","02. Servizio","03. Assistenza e cura",null,"04. Cura","05. Terapie","06. Medico","07. Medicamenti","08. Materiale "]
["Verifica della Ripartizione dei costi generali su CdC principali e servizi annessi CPA",null,null,null,"AGI","E6.6020",{"$f":"+K79","v":0},null,null,"E6",null,"alberghiero ","non LAMal",null,"LAMal",null,null,"ES / EMT","EMAp"]
[null,null,null,null,"Partecipaz. CM cure CAT-STT","E6.6051",{"$f":"+K81","v":300000},null,null,"E6.6010.02",{"$f":"SUM(L78:S78)","v":170000},{"$f":"ROUND(-'Contabilità per CDC - SOMED'!AB62,0)","v":170000}]
["Totale costi da ripartire",{"$f":"+F37","v":4052927},"    = E0.200.01",null,"Partecipaz. ospiti cure CAT-STT","E6.6052",{"$f":"+K82","v":0},null,null,"E6.6020",{"$f":"SUM(L79:S79)","v":0}]
[null,null,null,null,"Tot. Ricavi analitici da COIN","E6.69",{"$f":"+K84","v":0},null,null,"E6.6050",{"$f":"SUM(L80:S80)","v":2328750},null,null,null,{"$f":"ROUND(SUM(O81:O83),0)","v":2252750},{"$f":"ROUND(SUM(P81:P83),0)","v":30500},{"$f":"ROUND(SUM(Q81:Q83),0)","v":0},{"$f":"ROUND(SUM(R81:R83),0)","v":22500},{"$f":"ROUND(SUM(S81:S83),0)","v":23000}]
["Costi ripartiti : ",null,null,null,"Totale ricavi analitici COAN",null,{"$f":"SUM(G76:G80)","v":470000},null,null,"E6.6051",{"$f":"ROUND(SUM(L81:S81),0)","v":300000},null,null,null,{"$f":"ROUND(-'Contabilità per CDC - SOMED'!AB63,0)-P81-Q81-R81-S81","v":247000},30500,0,22500,0]
[" - su CPA - cure stazionarie: ",{"$f":"K51-K37","v":3206598},"   =  E1.300.01 -  E1.200.01",null,null,null,null,null,null,"E6.6052",{"$f":"ROUND(SUM(L82:S82),0)","v":0}]
["  - su CDT: ",{"$f":"H51-H37","v":0},"   =  E0.300.160 - E0.200.160 ",null,"Deficit d'esercizio CAT-STT (senza CG !)",null,{"$f":"G81-G74","v":-2028750},"> = CG > E6.6053.04+06!",null,"E6.6053.04+08",{"$f":"ROUND(SUM(L83:S83),0)","v":2028750},null,null,null,{"$f":"ROUND(-G83,0)-S83","v":2005750},null,null,null,23000]
["  - su Reparto CAT-STT:",{"$f":"V51-V37","v":846331},"   =  E5.300.01 - E5.200.05 ",null,null,null,null,null,null,"E6.69",{"$f":"SUM(K85:K88)","v":0}]
["Totale costi ripartiti ",{"$f":"SUM(B82:B84)","v":4052929},null,null,null,null,null,null,null,"E6.6900",0]
[null,null,null,null,null,null,null,null,null,"E6.6950",0]
["Costi non ripartiti ",{"$f":"+B79-B85","v":-2},"  ",null,null,null,null,null,null,"E6.6960",0]
[null,null,null,null,null,null,null,null,null,"E6.6970",0,null,null,null,null,null,"Risultato d'esercizio E3 - CAT-STT"]
[null,null,null,null,null,null,null,null,null,"E6.100.01",{"$f":"SUM(K78:K80,K84)","v":2498750},null,null,null,null,null,"CAT-STT","E3.11",{"$f":"K89-V51","v":0}]

{"sheet":"Istruzioni COIN","index":9,"n_rows":61,"n_cols":5,"rows_kept":61,"cut":false,"hidden":false,"merged":[]}
["Istruzioni per la contabilità degli investimenti"]
["1. Compilare il foglio \"Parametri\""]
["2. Completare il foglio \"Investimenti\" aggiornando la lista con tutti gli investimenti a bilancio per l'anno in esame"]
["3. Il foglio \"Resoconti COIN\" è calcolato automaticamente. "]
["    Una volta completate le registrazioni, esaminare e stampare il Resoconto per UACD, la tabella delle differenze e il Resoconto per SOMED. "]
["   Se la tabella che confronta i costi di utilizzo delle imobilizzazioni della COIN e della COAN mostra delle divergenze, decidere se occorre o meno corrggere i dati. "]
["4. A verifica ultimata, creare il file di esportazione per SOMED (capitolo E4) usando il pulsante  [Crea dati SOMED COIN] "]
["   situato nel foglio \"Resoconti COIN\""]
[]
["Istruzioni per compilare il foglio \"Investimenti\""]
["Ogni investimento corrisponde a una riga di dati. Per ogni investimento a bilancio compilare le celle con le seguenti  modalità:  "]
["celle bianche","digitare le informazioni richieste"]
["celle celesti","compilare scegliendo il valore dal menu a tendina"]
["celle verdi","campi calcolati automaticamente"]
["I campi obbligatori sono contrassegnati con un asterisco *"]
["Di seguito precisiamo il contenuto delle diverse colonne:"]
[]
["Colonna","Nome della variabile","Descrizione","Tipo di dato","Osservazioni (per vostra informazione, precisiamo il calcolo effettuato dalla formula)"]
["A*","Identificativo investimento","Identificativo dell'investimento a Bilancio (ad esempio \"1500-01\" per il terreno).\nAttenzione: Mettere \"X\" se il cespite non è attivato a bilancio (in particolare vale per quelle CPA comunali che non dispongono di una COIN separata da quella del Comune).","Testo"]
["B*","Quantità","Numero di oggetti di cui si compone l'investimento \n(per oggetti singoli inserire \"1\")","Numero intero"]
["C*","Oggetto","Denominazione dell'oggetto","Testo"]
["D","Marca/tipo","Denominazione di marca e tipo secondo il fornitore","Testo"]
["E","Ubicazione ","Ubicazione all'interno del centro di costo, di regola il locale dove si trova","Testo"]
["F","Fornitore","Nome del fornitore con CAP","Testo"]
["G*","Centro di costo","Centro di costo dove è situato il bene","Secondo elenco","L'elenco di tutti i centri di costo è riportato nel foglio \"Codici COIN\" "]
["H*","Data di acquisto","Data di messa in servizio (o data della fornitura o della fattura)","GG.MM.AAAA","La data di messa in servizio serve a calcolare i mesi di utilizzo durante l'anno (prorata)"]
["I","Anni vita economica","Durata di vita in anni (secondo la categoria d'investimento)","Numero intero","  = dipendente dalla categoria d'investimento (vedi foglio \"Codici COIN\")"]
["J*","Categoria d'investimento","Categoria (tipo) di investimento ","Secondo elenco","L'elenco delle categorie è riportato nel foglio \"Codici COIN\""]
["K*","Prezzo al pezzo","Prezzo unitario d'acquisto (in CHF)","Numero intero"]
["L*","Costi d'installazione","Costi complessivi d'installazione e altri costi accessori all'acquisto (CHF)","Numero intero"]
["M","Valore iniziale totale d'investimento","Valore iniziale d'attivazione totale (CHF)\n= B * K + L","Numero intero","  = [Quantità] * [Prezzo al pezzo] + [Costi d'installazione]"]
["N","Ammortamento calcolatorio annuo","Ammortamento calcolatorio, secondo la categoria di investimento e il prorata (CHF)\n= (M / I) * (S / 12)","Numero decimale","  = 0 se [Anni di vita economica] è n/a\n  = 0 se [Valore iniziale totale d'investimento] è 1.- CHF\n  = 0 se [Data di acquisto] è sconosciuta\n  =   ([Valore iniziale totale d'investimento] / [Anni di vita economica])\n    * ([Mesi utilizzati durante l'anno] / 12)"]
["O","Ammortamento calcolatorio annuo, \nriconosciuto LAMal","Parte riconosciuta LAMal dell'ammortamento calcolatorio annuo (CHF)\n= N * Z","Numero decimale","  = [Ammortamento calcolatorio annuo] * [Quota riconosciuta LAMal (in %)]"]
["P","Conto per registrazione dell'ammortamento","Numero di conto COFI dove è registrato l'ammortamento ","Testo"]
["Q","Durata di vita residua","Durata di vita residua in anni al 31.12","Numero decimale","  = 0 se [Anni di vita economica] è n/a\n  = 0 se [Data di acquisto] è sconosciuta\n  = max( calcolo dei mesi di vita rimanenti trasformati in anni; 0)"]
["R","Investimento ancora attivo","Bene ancora utilizzato (Sì) o dismesso (No)","(\"SI\", \"NO\")","  = 0 se [Data di acquisto] è sconosciuta\n  = \"no, dismesso\" se [Data del disinvestimento o eliminazione] <> \"\"\n  = \"Sì\" altrimenti"]
["S","Mesi utilizzati durante l'anno","Numero di mesi in cui il bene è stato utilizzato durante l'anno considerato\n (per calcoli pro-rata)","Numero intero \nda 1 a 12","  = (calcolo dei mesi utilizzati durante l'anno, formula complessa!)"]
["T","Val. invest. al 31.12. dopo ammortamento","Valore residuo del bene alla fine dell'anno considerato\n= M * Q / I","Numero decimale","  = 0 se [Investimento ancora attivo]<>\"Sì\"\n  = [Valore iniziale totale d'investimento] se [Categoria d'investimento]=\"1500 Terreni\"\n  = 1 se [Valore iniziale totale d'investimento] = 1\n  = 0 se [Data di acquisto] è sconosciuta\n  = [Valore iniziale totale d'investimento] * [Durata di vita residua] / [Anni di vita economica]"]
["U","Val. invest. LAMal dopo ammort. senza amm. eccess.","= T * Z","Numero decimale","  = [Val. invest. al 31.12. dopo ammortamento] * [Quota riconosciuta LAMal (in %)]"]
["V","Val. invest. per calcolo interessi","Valore medio dell'investimento (CHF)\n= M per i terreni\n= (M / 2) per tutti gli altri investimenti ancora attivi","Numero decimale","  = 0 se se [Valore iniziale totale d'investimento] = 1\n  = [Valore iniziale totale d'investimento] se [Categoria d'investimento]=\"1500 Terreni\"\n  = [Valore iniziale totale d'investimento]/2 per gli altri investimenti"]
["W","Interessi calcolatori annui","Prorata secondo i mesi di utilizzo (CHF)\n= V * 3.7% * (S / 12)","Numero decimale","  = [Val. invest. per calcolo interessi] * 3.7% * [Mesi utilizzati durante l'anno] / 12"]
["X","Interessi calcolatori annui, riconosciuti LAMal","Parte riconosciuta LAMal degli interessi calcolatori annui (CHF)\n= W * Z","Numero decimale","  = 0 se [Val. invest. per calcolo interessi] <= 0\n  = [Interesse calcol. Annuo] * [Quota parte LAMal in %]"]
["Y","Canone di locazione","Canone di locazione per immobilizzazioni oltre il limite di attivazione e non attivate a bilancio (ad es. le case comunali senza COIN vera e propria possono indicare il canone di affitto)","Numero decimale"]
["Z","Quota riconosciuta LAMal (in %)","Parte dell'investimento riconosciuta LAMal, in %","Numero intero","Questo valore serve a calcolare le colonne O e X"]
["AA","Data del disinvestimento o eliminazione","Data del disinvestimento (cessione o eliminazione del bene)","GG.MM.AAAA"]
["AB","Valore del disinvestimento","Valore residuo del bene al momento del disinvestimento","Numero decimale","  = … complicato …"]
["AC","Osservazioni","Campo per osservazioni"]
["AD","Costi calcolatori annui totali di utilizzo ","Costi calcolatori totali di utilizzo delle immobilizzazioni (CHF)\n= N + W",null,"  = [Ammortamento calc. annuo] + [Interesse calcol. annuo]"]
["AE","   di cui a carico dei Comuni (6900) ","Parte teorica dei costi calcolatori totali annui a carico dei Comuni. La ripartizione avviene in base alla ripartizione del finanziamento iniziale:\n= (AJ + 80% * AM) * (AD  / M)\n ",null,"  = 0 se [Valore iniziale totale d'investimento] <= 0\n  = [Contributi dei comuni (6900)] + 80% * [Utilizzo fondo 3 manutenzione e investimenti] * [Costi calcolatori annui totali di utilizzo] / [Valore iniziale totale d'investimento]"]
["AF","   di cui a carico del Cantone (6950) ","Parte teorica dei costi calcolatori totali annui a carico del Cantone. La ripartizione avviene in base alla ripartizione del finanziamento iniziale: \n= (AK + 20% * AM) * (AD / M)\n ",null,"  = 0 se [Valore iniziale totale d'investimento] <= 0\n  = [Contributi dei Cantoni (6950)] + 20% * [Utilizzo fondo 3 manutenzione e investimenti] * [Costi calcolatori annui totali di utilizzo] / [Valore iniziale totale d'investimento]"]
["AG","   di cui a carico della Confederazione (6960) ","Parte teorica dei costi calcolatori totali annui a carico della Confederazione. La ripartizione avviene in base alla ripartizione del finanziamento iniziale: \n= AL * (AD / M)\n ",null,"  = 0 se [Valore iniziale totale d'investimento] <= 0\n  = [Contributi della Confederazione (6960)] * [Costi calcolatori annui totali di utilizzo] / [Valore iniziale totale d'investimento]"]
["AH","   di cui a carico di corporazioni, fondazioni, privati","Parte teorica dei costi calcolatori totali annui a carico di Fondazioni, Associazioni, Cooperative, SA private ed eventuali donazioni dedicate. La ripartizione avviene in base alla ripartizione del finanziamento iniziale.\n= AN * (AD / M)",null,"  = 0 se [Valore iniziale totale d'investimento] <= 0\n  = [Contributi di corporazioni, fondazioni, privati (6970)] * [Costi calcolatori annui totali di utilizzo] / [Valore iniziale totale d'investimento]"]
["AI","Finanziamento totale","Finanziamento totale (corrisponde al valore totale iniziale dell'investimento)\n= L",null,"  = [Valore iniziale totale d'investimento]"]
["AJ","Contributi dei Comuni (6900)","Contributi iniziali al finanziamento dei Comuni"]
["AK","Contributi dei Cantoni (6950)","Contributi iniziali al finanziamento dal Cantone"]
["AL","Contributi della Confederazione (6960)","Contributi iniziali al finanziamento dalla Confederazione"]
["AM","Utilizzo fondo 3 manutenzione e investimenti","Contributi iniziali al finanziamento prelevati dal fondo 3"]
["AN","Contributi di Enti privati (fondaz., associaz., coop., SA, donazioni) (6970)","Finanziamenti di fondazioni, associazioni, cooperative, SA ed eventuali donazioni dedicate\n= AI - AJ - AK - AL - AM",null,"  = [Finanziamento totale] - [Contributi dei comuni (6900)] - [Contributi dei cantoni (6950)] - [Contributi della Confederazione (6960)] - [Utilizzo fondo 3 manutenzione e investimenti]"]
["AO","Sterilizzazione contributi comunali","Sterilizzazione annua (ammortamenti) dei contributi comunali per investimenti\n= N / M * AJ",null,"  = [Ammortamento calcolatorio annuo] / [Valore iniziale totale d'investimento] * [Contributi dei comuni (6900)]"]
["AP","Sterilizzazione contributi cantonali","Sterilizzazione annua (ammortamenti) dei contributi cantonali per investimenti\n= N / M * AK",null,"  = [Ammortamento calcolatorio annuo] / [Valore iniziale totale d'investimento] * [Contributi dei cantoni (6950)]"]
["AQ","Sterilizzazione contributi confederazione","Sterilizzazione annua (ammortamenti) dei contributi della Confederazione per investimenti\n= N / M * AL",null,"  = [Ammortamento calcolatorio annuo] / [Valore iniziale totale d'investimento] * [Contributi della Confederazione (6960)]"]

{"sheet":"Codici COIN","index":10,"n_rows":75,"n_cols":10,"rows_kept":75,"cut":false,"hidden":false,"merged":[[19,0,23,0],[41,0,52,0],[53,0,63,0],[64,0,73,0]]}
["Elenchi di codici per la Contabilità degli investimenti "]
[]
["Elenchi di codici in questo foglio: "]
[" - Categorie di investimento "]
[" - Centri di costo"]
[]
[]
["Categorie d'investimento"]
[]
["La categoria determina la durata di vita dell'investimento che a sua volta determina il tasso lineare di ammortamento."]
["Spiegazione dei segni: "]
["- n/a = non applicabile, non pertinente"]
["- duesi = durata di utilizzo economica specifica dell'immobilizzazione; oiché per alcune categorie non esiste una durata di vita applicabile a tutti gli investimenti, essa deve essere definita per ogni singolo bene della categoria nel foglio \"Investimenti\""]
[]
["Categoria di investimento ","Nome della categoria nei diversi strumenti",null,null,"Categorie / Tipologie di attivi","Durata ","Tasso ","Esempi di investimento che rientrano nella categoria","Valori nel menu a tendina","Durata nella"]
[null,"REKOLE","BILANCIO \nTI 2021","Conto per registrare l'ammortamento",null,"di vita in anni","lineare di ammorta-mento",null,"\n","colonna I del giornale "]
["Investimenti duraturi (con durata di vita indefinita)","A0","1500","4420.00","Terreni","n/a","n/a","Comprende i terreni edificati (mappale dove è ubicata la struttura) o non (es. appezzamenti di \"riserva\", sedimi ad uso di parco, giardino o parcheggio).\nSi registra unicamente il valore storico d'acquisto del terreno (separato dal valore dell’edificio!), utilizzando metodi di stima riconosciuti se si disponesse unicamente del valore congiunto terreno-edificio\n(in precedenza per la Statistica SOMED-A il valore del terreno è stato stimato secondo 3 fasce indicative di valore:  CHF 100.- / mq per strutture ubicate in zone discoste e di montagna;\nCHF 300.-/ mq per zone periurbane e CHF 400.-/mq per zone cittadine o centrali).\nTale categoria di attivo fisso non prevede ALCUN ammortamento, solo il calcolo degli interessi calcolatori!","1500 - Terreni","n/a"]
["Investimenti con durata di vita lunga (>30 anni)","An","1501","4420.10","Edifici ",33,0.03,"Comprende l’edificio principale usato quale Casa per anziani ed altri immobili a scopo aziendale o di reddito (legati all'attività di cure stazionarie o ambulatoriali della Casa): si registra solo il valore dell’edificio, separato dal valore del terreno!\nEs. nuove costruzioni, ampliamenti, ristrutturazioni / riattazioni. Interventi che toccano le \"mura\" e le strutture portanti esterne ed interne degli edifici!","1501 - Edifici",{"$f":"+F18","v":33}]
["Investimenti con durata di vita media (tra 15 e 30 anni) \nInstallazioni tecniche degli edifici","Cn","1502","4420.20\no\n4420.30","Installazioni tecniche degli edifici ",20,0.05,"Comprende le installazioni sanitarie, elettriche, di riscaldamento, di ventilazione, di climatizzazione, di sicurezza e i cablaggi.\nEs. impianti e condotte di riscaldamento e sanitari, caldaie; installazioni elettriche principali, cablatura reti Wi-Fi, impianti foto-voltaici, tapparelle e gelosie, tetti e lavori di carpenteria, verande, installazioni per la gestione di spazi esterni (impianti di irrigazione, apparecchi automatici per il pagamento del posteggio, ecc.).","1502 - Installazioni tecniche",{"$f":"+F19","v":20}]
["Investimenti con durata di vita corta (tra 5 e 15 anni)","D1","1510","4421.00","Mobilio, macchine industriali",10,0.1,"Comprende tutti i tipi di mobilio quali arredi per l'ufficio, tavoli, sedie, letti, scaffalature, sistemi di magazzino, ecc.\nEs. mobilio per ufficio (mobili, Cardex); arredamento di spazi comuni (sedie, tavoli); arredamento di spazi destinati al personale (armadietti, spogliatoi); arredamento di spazi per ospiti (letti, comodini, materassi); anche macchine industriali (lavatrici, asciugatrici, forni, cucine).","1510 - Mobilio, macch. industriali",10]
[null,"D2","1511","4421.10","Macchine per ufficio e sistemi di comunicazione",5,0.2,"Comprende tutte le macchine ed i sistemi di comunicazione non informatici.\nEs. macchine per ufficio (fax, stampanti, distruggi-documenti); telefonia e TV (apparecchia-ture telefoniche, centraline, radio, televisioni); sistemi d'allarme e antifurto, ecc.","1511 - Macch. per ufficio e comunicaz.",5]
[null,"D3","1512","4421.20","Veicoli",5,0.2,"Comprende tutti i tipi di veicoli.\nEs. ambulanze, automobili ad uso aziendale, pulmini, furgoni, trattorini, cala per neve, ecc.","1512 - Veicoli",5]
[null,"D4","1513","4421.30","Apparecchi e utensili d'esercizio",5,0.2,"Comprende tutti gli apparecchi ed utensili per attività di pulizia, cucina, giardinaggio e manutenzione.\nEs. apparecchi per pulizia (idro-pulitrici, lavapavimenti), per la lavanderia (piccole lavatrici e asciugatrici), per la cucina (piccoli forni, cucinette ai piani) e manutenzione (tagliaerba), utensili d'esercizio (carrelli porta-vivande e piatti), ecc. ","1513 - Apparecchi e utensili d'eserciz.",5]
[null,"E1","1514","4421.40","Macchinari, apparecchiature e strumenti medico tecnici ",8,0.125,"Comprende tutte le immobilizzazioni medico-tecniche.\nEs. macchinari medico-tecnici per le cure (ecografi, sollevatori, carrelli medici, macchine vuota-vasi), macchinari per fisioterapia e ergoterapia, ecc.","1514 - Apparecchiature medico-tecniche",8]
["Investimento con durata di vita molto breve (3-5 anni)",null,"1515/16","4421.50\no\n4421.60","Hardware e Software",4,0.25,"1515: comprende tutte le apparecchiature informatiche.\nEs. server, PC, notebook, tablet, monitor, componenti di rete, estensioni (fisiche) di memorie, ecc.\n1516: comprende tutti i software acquistati con un importo una tantum (mentre non rientrano i canoni annui di licenza e manutenzione!).\nEs. software amministrativi e gestionali (MS Office, ISAWin, Opale, e-Clinic, SAP, ecc.), software per la gestione e la qualità delle cure (RAI-RUG, ecc.), programmi informatici specifici, ecc.","1515/16 - Hard e software",4]
["Costruzioni con durata provvisoria (<3 anni)",null,"da 1500 \na 1700",null,"Costruzioni con durata provvisoria (<3 anni)","duesi","duesi","Installazioni esterne provvisorie (es. tendone) o altre infrastrutture, di durata inferiore ai 3 anni.","Costruzioni provvisorie"]
["Progetti pluriannuali prima di inizio uso, costruzioni in corso",null,"da 1500\na 1700",null,"Progetti e costruzioni in corso","duesi","duesi","Di regola per nuove costruzioni, ampliamenti, ristrutturazioni / riattazioni di importanza rilevante; la durata di vita economica e il valore d'investimento tot. prende avvio alla conclusione dei lavori (o occupazione dei nuovi spazi da parte dei primi ospiti).","Progetti in corso"]
[]
[]
["Elenco dei centri di costo usati nei vari strumenti"]
[]
["Spiegazione dei segni: "]
["- i centri di costo tra parentesi non sono utilizzati nel relativo sistema"]
["- il centro di costo Terapie LAMal, somma di 130-131-132, non è previsto nel menu a tendina poiché non è usato (come somma) nel sistema COAN TI 2021"]
["- in rosso i cambiamenti introdotti dall'UST rispetto alla versione precedente"]
["- n/a : centro di costo non incluso in SOMED (SOMED rileva i dati solo della parte \"Istituto di cura LAMal\")"]
["- la colorazione dello sfondo del centro di costo è la stessa usata nel foglio \"Ripartizioni\""]
[]
[]
["Categoria di centro di costo ","Numero del CC nei diversi strumenti",null,null,"Denominazione del centro di costo",null,null,"Valori nel menu a tendina"]
[null,"COAN TI 2021","SOMED 2021",null,null,null,null,"\n"]
["CC-Generali","010","010",null,"Edifici",null,null,{"$f":"CONCATENATE(B42,\" - \",E42)","v":"010 - Edifici"}]
[null,"011","015",null,"Energia",null,null,{"$f":"CONCATENATE(B43,\" - \",E43)","v":"011 - Energia"}]
[null,"020","020",null,"Servizio tecnico",null,null,"020 - Servizio tecnico"]
[null,"021","021",null,"Servizio trasporti",null,null,"021 - Servizio trasporti"]
[null,"030","030",null,"Direzione e amministrazione",null,null,"030 - Direzione e amministrazione"]
[null,"040","040",null,"Economia domestica in generale",null,null,"040 - Economia domestica in generale"]
[null,"041","041",null,"Lavanderia",null,null,"041 - Lavanderia"]
[null,"042","042",null,"Pulizia",null,null,"042 - Pulizia"]
[null,"060","060",null,"Cucina",null,null,"060 - Cucina"]
[null,"090","090",null,"Magazzino centrale",null,null,"090 - Magazzino centrale"]
[null,"095","095",null,"Farmacia",null,null,"095 - Farmacia"]
[]
["CC-Principali",100,220,null,"Servizio alberghiero",null,null,{"$f":"CONCATENATE(B54,\" - \",E54)","v":"100 - Servizio alberghiero"}]
[null,110,230,null,"Animazione (Assistenza non LAMal)",null,null,{"$f":"CONCATENATE(B55,\" - \",E55)","v":"110 - Animazione (Assistenza non LAMal)"}]
[null,115,231,null,"Cure LAMal",null,null,"115 - Cure LAMal"]
[null,"(130-132)",241,null,"Terapie LAMal (fisio+ergo+altre)"]
[null,"130","(241a)",null,"Fisioterapia",null,null,"130 - Fisioterapia"]
[null,131,"(241b)",null,"Ergoterapia",null,null,"131 - Ergoterapia"]
[null,132,"(241c)",null,"Altre consulenze e terapie",null,null,"132 - Altre consulenze e terapie"]
[null,140,240,null,"Servizio medico",null,null,"140 - Servizio medico"]
[null,150,250,null,"Materiale EMAp",null,null,"150 - Materiale EMAp"]
[null,151,251,null,"Medicamenti ES/EMT",null,null,"151 - Medicamenti ES/EMT"]
[]
["CC-Servizi Annessi",160,160,null,"Cure acute transitorie (CAT)",null,null,{"$f":"CONCATENATE(B65,\" - \",E65)","v":"160 - Cure acute transitorie (CAT)"}]
[null,161,161,null,"Soggiorni terapeutici temporanei (STT)",null,null,{"$f":"CONCATENATE(B66,\" - \",E66)","v":"161 - Soggiorni terapeutici temporanei (STT)"}]
[null,162,162,null,"Cure palliative",null,null,"162 - Cure palliative"]
[null,163,163,null,"Reparto Alzheimer",null,null,"163 - Reparto Alzheimer"]
[null,"16X","16X",null,"Stazionario n",null,null,"16X - Stazionario n"]
[null,170,"(n/a)",null,"Ambulatorio medico",null,null,"170 - Ambulatorio medico"]
[null,171,171,null,"Centro diurno terapeutico (CDT)",null,null,"171 - Centro diurno terapeutico (CDT)"]
[null,172,"(n/a)",null,"Appartamenti protetti",null,null,"172 - Appartamenti protetti"]
[null,"17X","(n/a)",null,"Ambulatorio n (es. CD socio-assistenziale)",null,null,"17X - Ambulatorio n (es. CD socio-assistenziale)"]
[]
["CC-Gestione estranea","9XX","(n/a)",null,"Gestione estranea",null,null,{"$f":"CONCATENATE(B75,\" - \",E75)","v":"9XX - Gestione estranea"}]

{"sheet":"Cespiti ContabilitàInvestimenti","index":11,"n_rows":107,"n_cols":45,"rows_kept":107,"cut":false,"hidden":false,"merged":[[3,29,3,33],[3,34,3,39],[3,40,3,42]]}
["Contabilità degli investimenti (valori al lordo per tutti gli investimenti a bilancio)"]
[{"$f":"Parametri!$B$7","v":2021},{"$f":"Parametri!$B$3","v":"ESEMPIO - CPA STANDARD CON CAT-STT"},null,null,null,"Data di calcolo:",{"$f":"Parametri!$B$17","v":"2021-12-31"}]
[]
[null,null,null,null,null,null,null,null,null,null,null,null,null,null,null,null,null,null,null,null,null,null,null,null,null,null,null,null,null,"Ripartizione calcolatoria dei costi di utilizzo annuali, in base a colonne AJ-AN",null,null,null,null,"Contributi e sovvenzioni iniziali totali all'investimento ",null,null,null,null,null,"Ripartizione degli ammortamenti annui"]
["Identificativo investimento*","Quantità*","Oggetto*","Marca/tipo","Ubicazione","Fornitore","Centro di costo*","Data di acquisto*","Anni vita economica","Categoria d'investimento*","Prezzo al pezzo*","Costi d'installazione*","Valore iniziale totale d'investimento","Ammortamento calcolatorio annuo","Ammortamento calcolatorio annuo, riconosciuto  LAMal","Conto COFI/COAN per registrazione dell'ammortamento","Durata di vita residua","Investimento ancora attivo","Mesi utilizzati durante l'anno","Val. invest. al 31.12. dopo ammortamento","Val. invest. LAMal dopo ammort. senza amm. eccess.","Val. invest. per calcolo interessi","Interessi calcolatori annui","Interessi calcolatori annui, riconosciuti LAMal","Canone di locazione COAN-COIN","Quota riconosciuta LAMal (in %)","Data del \ndisinvestimento o eliminazione","Valore del disinvestimento","Osservazioni","Costi calcolatori annui totali di utilizzo","di cui a carico dei Comuni (6900)","di cui a carico del Cantone (6950)","di cui a carico della Confederazione (6960)","di cui a carico di Enti privati (fondaz., associaz., coop., SA, donazioni) (6970)","Finanziamento totale","Contributi dei Comuni (6900)","Contributi dei Cantoni (6950)","Contributi della Confederazione (6960)","Utilizzo fondo 3 manutenzione e investimenti","Contributi di Enti privati (fondaz., associaz., coop., SA, donazioni) (6970)","Sterilizzazione contributi comunali","Sterilizzazione contributi cantonali","Sterilizzazione contributi Confederazione"]
["(TESTO","(NO. INTERO)","(TESTO)","(TESTO)","(TESTO)","(TESTO)","(ELENCO)","(GG.MM.AAAA)","(NO. INTERO)","(ELENCO)","(NO. INTERO)","(NO. INTERO)","(NO. INTERO)","(NO. DECIMALE)","(NO. DECIMALE)","(TESTO)","(NO. DECIMALE)","(Sì, No)","(NO. INTERO)","(NO. DECIMALE)","(NO. DECIMALE)","(NO. DECIMALE)","(NO. DECIMALE)","(NO. DECIMALE)","(NO. DECIMALE)","(NO. INTERO)","(GG.MM.AAAA)","(NO. DECIMALE)","(TESTO)",null,null,null,null,null,null,null,{"$f":"AI6*0.3","v":0},null,null,null,null,null,null,null,"check"]
["1500-00",1,"Terreno CPA",null,"Mapp. XXX RFD, 6500 Bellinzona (10'000 mq)",null,"010 - Edifici","1995-06-01",{"$f":"IFERROR(VLOOKUP(MID(J7,1,SEARCH(\"-\",J7,1)-2),'Codici COIN'!$C$16:$J$27,8,FALSE),\"\")","v":"n/a"},"1500 - Terreni",4000000,null,{"$f":"B7*K7+L7","v":4000000},{"$f":"IF(OR(I7=\"n/a\",M7=1,H7<=0),0,M7/I7*S7/12)","v":0},{"$f":"N7*Z7","v":0},"4420.00",{"$f":"IF(OR(I7=\"n/a\",H7=0),0,MAX(I7-(DATEDIF(H7,$G$2,\"M\")+1)/12,0))","v":0},{"$f":"IF(H7<=0,\"\",IF(AA7>0,\"No, dismesso\",\"Sì\"))","v":"Sì"},{"$f":"IF(H7=0,0,IF(R7=\"Sì\",IF(YEAR(H7)=YEAR($G$2),12-MONTH(H7)+1,IF(YEAR(H7)+IF(I7=\"n/a\",999,I7)=YEAR($G$2),MONTH(H7)-1,IF(YEAR(H7)+IF(I7=\"n/a\",999,I7)<YEAR($G$2),0,12))),IF(AND(AA7>0,YEAR(AA7)<YEAR($G$2)),0,MAX(0,MIN(MONTH(AA7),IF(I7=\"n/a\",999,I7)*12-DATEDIF(H7,DATE(YEAR($G$2),1,1),\"M\"))))))","v":12},{"$f":"IF(R7<>\"Sì\",0,IF(J7='Codici COIN'!$I$17,M7,IF(Q7=0,1,IF(H7>0,M7*Q7/I7,0))))","v":4000000},{"$f":"+T7*Z7","v":0},{"$f":"IF(AND(T7=1,S7=0),0,IF(J7='Codici COIN'!$I$17,M7,M7/2))","v":4000000},{"$f":"V7*Parametri!$B$13*S7/12","v":148000},{"$f":"IF(V7>0,W7*Z7,0)","v":0},null,null,null,{"$f":"IF(AA7>0,IF(I7=\"n/a\",M7,MAX(0,(I7-(DATEDIF(H7,AA7,\"M\")+1)/12)*M7/I7)),\"\")","v":""},"Prezzo del terreno a scopo \"sociale\" stimato SOMED-A in CHF 400.-/mq, terreno di proprietà",{"$f":"N7+W7","v":148000},{"$f":"IF($M7>0,($AD7/$M7)*(AJ7+80%*$AM7),0)","v":0},{"$f":"IF($M7>0,($AD7/$M7)*(AK7+20%*$AM7),0)","v":0},{"$f":"IF($M7>0,($AD7/$M7)*(AL7),0)","v":0},{"$f":"IF($M7>0,($AD7/$M7)*AN7,0)","v":148000},{"$f":"M7","v":4000000},null,null,null,null,{"$f":"AI7-AJ7-AK7-AL7-AM7","v":4000000},{"$f":"IF(M7>0,$N7/$M7*AJ7,0)","v":0},{"$f":"IF(M7>0,$N7/$M7*AK7,0)","v":0},{"$f":"IF(M7>0,$N7/$M7*AL7,0)","v":0},null,{"$f":"SUM(Tabella1[[#This Row],[Contributi dei Comuni (6900)]:[Contributi di Enti privati (fondaz., associaz., coop., SA, donazioni) (6970)]])-Tabella1[[#This Row],[Finanziamento totale]]","v":0}]
["1501-01",1,"Edificazione CPA (cure stazionarie)",null,"Via Locarno 100, 6500 Bellinzona","diversi","010 - Edifici","1995-06-01",{"$f":"IFERROR(VLOOKUP(MID(J8,1,SEARCH(\"-\",J8,1)-2),'Codici COIN'!$C$16:$J$27,8,FALSE),\"\")","v":33},"1501 - Edifici",16000000,null,{"$f":"B8*K8+L8","v":16000000},{"$f":"IF(OR(I8=\"n/a\",M8=1,H8<=0),0,M8/I8*S8/12)","v":484848.48484848486},0,"4420.10",6.4166666666666679,"Sì",12,{"$f":"IF(R8<>\"Sì\",0,IF(J8='Codici COIN'!$I$17,M8,IF(Q8=0,1,IF(H8>0,M8*Q8/I8,0))))","v":3111111.1111111119},0,{"$f":"IF(AND(T8=1,S8=0),0,IF(J8='Codici COIN'!$I$17,M8,M8/2))","v":8000000},{"$f":"V8*Parametri!$B$13*S8/12","v":296000},0,null,null,null,"","Apertura CPA 1.06.1995. Piano di finanziam.: 30% Lanz; 30% Confed. (AVS); 20% mezzi propri; 20% mutuo bancario NON riconosciuto",780848.48484848486,0,234254.54545454547,234254.54545454547,312339.39393939398,16000000,null,4800000,4800000,null,{"$f":"AI8-AJ8-AK8-AL8-AM8","v":6400000},{"$f":"IF(M8>0,$N8/$M8*AJ8,0)","v":0},145454.54545454547,{"$f":"IF(M8>0,$N8/$M8*AL8,0)","v":145454.54545454547},null,{"$f":"SUM(Tabella1[[#This Row],[Contributi dei Comuni (6900)]:[Contributi di Enti privati (fondaz., associaz., coop., SA, donazioni) (6970)]])-Tabella1[[#This Row],[Finanziamento totale]]","v":0}]
["1501-02",1,"Ristrutturazione CPA 2015",null,"CPA","diversi","010 - Edifici","2015-12-31",{"$f":"IFERROR(VLOOKUP(MID(J9,1,SEARCH(\"-\",J9,1)-2),'Codici COIN'!$C$16:$J$27,8,FALSE),\"\")","v":33},"1501 - Edifici",5000000,null,5000000,151515.15151515152,0,"4420.10",26.916666666666668,"Sì",12,{"$f":"IF(R9<>\"Sì\",0,IF(J9='Codici COIN'!$I$17,M9,IF(Q9=0,1,IF(H9>0,M9*Q9/I9,0))))","v":4078282.8282828284},0,{"$f":"IF(AND(T9=1,S9=0),0,IF(J9='Codici COIN'!$I$17,M9,M9/2))","v":2500000},{"$f":"V9*Parametri!$B$13*S9/12","v":92500},0,null,null,null,"","Lavori terminati 31.12.2013. Piano di finanziam.: 50% Lanz; 20% utilizzo Fondo 1; 30% mutuo bancario RICONOSCIUTO Lanz",244015.15151515152,97606.060606060608,146409.09090909091,0,0,5000000,1200000,2800000,null,1000000,0,36363.636363636368,84848.484848484848,0,null,{"$f":"SUM(Tabella1[[#This Row],[Contributi dei Comuni (6900)]:[Contributi di Enti privati (fondaz., associaz., coop., SA, donazioni) (6970)]])-Tabella1[[#This Row],[Finanziamento totale]]","v":0}]
["1502-01",1,"Lift - Sostituzione",null,"CPA","Schindler SA","020 - Servizio tecnico","2013-09-01",{"$f":"IFERROR(VLOOKUP(MID(J10,1,SEARCH(\"-\",J10,1)-2),'Codici COIN'!$C$16:$J$27,8,FALSE),\"\")","v":20},"1502 - Installazioni tecniche",120000,null,{"$f":"B10*K10+L10","v":120000},{"$f":"IF(OR(I10=\"n/a\",M10=1,H10<=0),0,M10/I10*S10/12)","v":6000},{"$f":"N10*Z10","v":0},"4420.20",{"$f":"IF(OR(I10=\"n/a\",H10=0),0,MAX(I10-(DATEDIF(H10,$G$2,\"M\")+1)/12,0))","v":11.666666666666666},{"$f":"IF(H10<=0,\"\",IF(AA10>0,\"No, dismesso\",\"Sì\"))","v":"Sì"},{"$f":"IF(H10=0,0,IF(R10=\"Sì\",IF(YEAR(H10)=YEAR($G$2),12-MONTH(H10)+1,IF(YEAR(H10)+IF(I10=\"n/a\",999,I10)=YEAR($G$2),MONTH(H10)-1,IF(YEAR(H10)+IF(I10=\"n/a\",999,I10)<YEAR($G$2),0,12))),IF(AND(AA10>0,YEAR(AA10)<YEAR($G$2)),0,MAX(0,MIN(MONTH(AA10),IF(I10=\"n/a\",999,I10)*12-DATEDIF(H10,DATE(YEAR($G$2),1,1),\"M\"))))))","v":12},{"$f":"IF(R10<>\"Sì\",0,IF(J10='Codici COIN'!$I$17,M10,IF(Q10=0,1,IF(H10>0,M10*Q10/I10,0))))","v":70000},{"$f":"+T10*Z10","v":0},{"$f":"IF(AND(T10=1,S10=0),0,IF(J10='Codici COIN'!$I$17,M10,M10/2))","v":60000},{"$f":"V10*Parametri!$B$13*S10/12","v":2220},{"$f":"IF(V10>0,W10*Z10,0)","v":0},null,null,null,{"$f":"IF(AA10>0,IF(I10=\"n/a\",M10,MAX(0,(I10-(DATEDIF(H10,AA10,\"M\")+1)/12)*M10/I10)),\"\")","v":""},"50% prelevamento Fondo 3 Infrastrutture ",{"$f":"N10+W10","v":8220},{"$f":"IF($M10>0,($AD10/$M10)*(AJ10+80%*$AM10),0)","v":3288.0000000000005},{"$f":"IF($M10>0,($AD10/$M10)*(AK10+20%*$AM10),0)","v":4932},{"$f":"IF($M10>0,($AD10/$M10)*(AL10),0)","v":0},{"$f":"IF($M10>0,($AD10/$M10)*AN10,0)","v":0},{"$f":"M10","v":120000},null,60000,null,60000,{"$f":"AI10-AJ10-AK10-AL10-AM10","v":0},{"$f":"IF(M10>0,$N10/$M10*AJ10,0)","v":0},{"$f":"IF(M10>0,$N10/$M10*AK10,0)","v":3000},{"$f":"IF(M10>0,$N10/$M10*AL10,0)","v":0},null,{"$f":"SUM(Tabella1[[#This Row],[Contributi dei Comuni (6900)]:[Contributi di Enti privati (fondaz., associaz., coop., SA, donazioni) (6970)]])-Tabella1[[#This Row],[Finanziamento totale]]","v":0}]
["1502-02",1,"Sostituzione e potenziamento caldaia",null,"CPA","Hoval SA","011 - Energia","2015-12-31",{"$f":"IFERROR(VLOOKUP(MID(J11,1,SEARCH(\"-\",J11,1)-2),'Codici COIN'!$C$16:$J$27,8,FALSE),\"\")","v":20},"1502 - Installazioni tecniche",90000,null,90000,4500,0,"4420.20",13.916666666666668,"Sì",12,{"$f":"IF(R11<>\"Sì\",0,IF(J11='Codici COIN'!$I$17,M11,IF(Q11=0,1,IF(H11>0,M11*Q11/I11,0))))","v":62625},0,{"$f":"IF(AND(T11=1,S11=0),0,IF(J11='Codici COIN'!$I$17,M11,M11/2))","v":45000},{"$f":"V11*Parametri!$B$13*S11/12","v":1665},0,null,null,null,"","50% prelevamento Fondo 3 Infrastrutture ",6165,2466,3699.0000000000005,0,0,90000,null,45000,null,45000,0,0,2250,0,null,{"$f":"SUM(Tabella1[[#This Row],[Contributi dei Comuni (6900)]:[Contributi di Enti privati (fondaz., associaz., coop., SA, donazioni) (6970)]])-Tabella1[[#This Row],[Finanziamento totale]]","v":0}]
["1500-02",1,"Formazione nuovi parcheggi e nuova segnaletica esterna",null,"CPA esterno","A+G SA","010 - Edifici","2018-08-01",{"$f":"IFERROR(VLOOKUP(MID(J12,1,SEARCH(\"-\",J12,1)-2),'Codici COIN'!$C$16:$J$27,8,FALSE),\"\")","v":"n/a"},"1500 - Terreni",50000,null,50000,0,0,"4420.00",0,"Sì",12,{"$f":"IF(R12<>\"Sì\",0,IF(J12='Codici COIN'!$I$17,M12,IF(Q12=0,1,IF(H12>0,M12*Q12/I12,0))))","v":50000},0,{"$f":"IF(AND(T12=1,S12=0),0,IF(J12='Codici COIN'!$I$17,M12,M12/2))","v":50000},{"$f":"V12*Parametri!$B$13*S12/12","v":1850},0,null,null,null,"","Spesa interamente finanziata dalla proprietà (auto-finanziamento con affitto parcheggi)",1850,0,0,0,1850,50000,null,null,null,null,50000,0,0,0,null,{"$f":"SUM(Tabella1[[#This Row],[Contributi dei Comuni (6900)]:[Contributi di Enti privati (fondaz., associaz., coop., SA, donazioni) (6970)]])-Tabella1[[#This Row],[Finanziamento totale]]","v":0}]
["1512-01",1,"Nuovo pulmino per trasporti",null,"Garage","Auto Golena SA","021 - Servizio trasporti","2020-05-01",{"$f":"IFERROR(VLOOKUP(MID(J13,1,SEARCH(\"-\",J13,1)-2),'Codici COIN'!$C$16:$J$27,8,FALSE),\"\")","v":5},"1512 - Veicoli",40000,null,40000,8000,0,"4421.20",3.333333333333333,"Sì",12,{"$f":"IF(R13<>\"Sì\",0,IF(J13='Codici COIN'!$I$17,M13,IF(Q13=0,1,IF(H13>0,M13*Q13/I13,0))))","v":26666.666666666664},0,{"$f":"IF(AND(T13=1,S13=0),0,IF(J13='Codici COIN'!$I$17,M13,M13/2))","v":20000},{"$f":"V13*Parametri!$B$13*S13/12","v":740},0,null,null,null,"","Acqusito nuovo pulmino Renault per servizio trasporti. Finanziamento 50% Fondo 3 e 50% donazione privata \"ad hoc\"",8740,3496,874,0,4370,40000,null,null,null,20000,20000,0,0,0,null,{"$f":"SUM(Tabella1[[#This Row],[Contributi dei Comuni (6900)]:[Contributi di Enti privati (fondaz., associaz., coop., SA, donazioni) (6970)]])-Tabella1[[#This Row],[Finanziamento totale]]","v":0}]
["1511-01",1,"Nuova centralina telefonica",null,"Ricezione","Swisscom","030 - Direzione e amministrazione","2017-11-01",{"$f":"IFERROR(VLOOKUP(MID(J14,1,SEARCH(\"-\",J14,1)-2),'Codici COIN'!$C$16:$J$27,8,FALSE),\"\")","v":5},"1511 - Macch. per ufficio e comunicaz.",30000,null,30000,6000,0,"4421.10",0.83333333333333304,"Sì",12,{"$f":"IF(R14<>\"Sì\",0,IF(J14='Codici COIN'!$I$17,M14,IF(Q14=0,1,IF(H14>0,M14*Q14/I14,0))))","v":4999.9999999999982},0,{"$f":"IF(AND(T14=1,S14=0),0,IF(J14='Codici COIN'!$I$17,M14,M14/2))","v":15000},{"$f":"V14*Parametri!$B$13*S14/12","v":555},0,null,null,null,"","Sostituzione della vecchia centralina telefonica del 2005. Finanziamento100% Fondo 3",6555,5244,1311,0,0,30000,null,null,null,30000,0,0,0,0,null,{"$f":"SUM(Tabella1[[#This Row],[Contributi dei Comuni (6900)]:[Contributi di Enti privati (fondaz., associaz., coop., SA, donazioni) (6970)]])-Tabella1[[#This Row],[Finanziamento totale]]","v":0}]
["1515-01",1,"Nuovo server informatico",null,"Direzione","Oracle","030 - Direzione e amministrazione","2019-06-01",{"$f":"IFERROR(VLOOKUP(MID(J15,1,SEARCH(\"-\",J15,1)-2),'Codici COIN'!$C$16:$J$27,8,FALSE),\"\")","v":4},"1515/16 - Hard e software",45000,null,45000,11250,0,"4421.50",1.4166666666666665,"Sì",12,{"$f":"IF(R15<>\"Sì\",0,IF(J15='Codici COIN'!$I$17,M15,IF(Q15=0,1,IF(H15>0,M15*Q15/I15,0))))","v":15937.499999999998},0,{"$f":"IF(AND(T15=1,S15=0),0,IF(J15='Codici COIN'!$I$17,M15,M15/2))","v":22500},{"$f":"V15*Parametri!$B$13*S15/12","v":832.5},0,null,null,null,"","Nuovo server informatico centrale. Finanziamento 100% Fondo 3",12082.5,9666,2416.5,0,0,45000,null,null,null,45000,0,0,0,0,null,{"$f":"SUM(Tabella1[[#This Row],[Contributi dei Comuni (6900)]:[Contributi di Enti privati (fondaz., associaz., coop., SA, donazioni) (6970)]])-Tabella1[[#This Row],[Finanziamento totale]]","v":0}]
["1510-01",1,"Nuovo arredo Direzione",null,"Direzione","Bulloni Sagl","030 - Direzione e amministrazione","2014-06-01",{"$f":"IFERROR(VLOOKUP(MID(J16,1,SEARCH(\"-\",J16,1)-2),'Codici COIN'!$C$16:$J$27,8,FALSE),\"\")","v":10},"1510 - Mobilio, macch. industriali",25000,null,25000,2500,0,"4421.00",2.416666666666667,"Sì",12,{"$f":"IF(R16<>\"Sì\",0,IF(J16='Codici COIN'!$I$17,M16,IF(Q16=0,1,IF(H16>0,M16*Q16/I16,0))))","v":6041.666666666667},0,{"$f":"IF(AND(T16=1,S16=0),0,IF(J16='Codici COIN'!$I$17,M16,M16/2))","v":12500},{"$f":"V16*Parametri!$B$13*S16/12","v":462.5},0,null,null,null,"","Nuovo arredo mobilio spazi Direzione. Finanziamento 100% Fondo 3",2962.5,2370,592.5,0,0,25000,null,null,null,25000,0,0,0,0,null,{"$f":"SUM(Tabella1[[#This Row],[Contributi dei Comuni (6900)]:[Contributi di Enti privati (fondaz., associaz., coop., SA, donazioni) (6970)]])-Tabella1[[#This Row],[Finanziamento totale]]","v":0}]
["1510-02",2,"Nuove lavatrici industriali",null,"Lavanderia","Miele AG","041 - Lavanderia","2014-03-15",{"$f":"IFERROR(VLOOKUP(MID(J17,1,SEARCH(\"-\",J17,1)-2),'Codici COIN'!$C$16:$J$27,8,FALSE),\"\")","v":10},"1510 - Mobilio, macch. industriali",16500,null,33000,3300,0,"4421.00",2.166666666666667,"Sì",12,{"$f":"IF(R17<>\"Sì\",0,IF(J17='Codici COIN'!$I$17,M17,IF(Q17=0,1,IF(H17>0,M17*Q17/I17,0))))","v":7150.0000000000018},0,{"$f":"IF(AND(T17=1,S17=0),0,IF(J17='Codici COIN'!$I$17,M17,M17/2))","v":16500},{"$f":"V17*Parametri!$B$13*S17/12","v":610.5},0,null,null,null,"","Acquisito 2x lavatrici Miele. Finanziamento 100% Fondo 3",3910.5,3128.3999999999996,782.09999999999991,0,0,33000,null,null,null,33000,0,0,0,0,null,{"$f":"SUM(Tabella1[[#This Row],[Contributi dei Comuni (6900)]:[Contributi di Enti privati (fondaz., associaz., coop., SA, donazioni) (6970)]])-Tabella1[[#This Row],[Finanziamento totale]]","v":0}]
["1513-01",1,"nuova piccola lavatrice",null,"CPA 2° piano","Nimis SA","100 - Servizio alberghiero","2018-02-01",{"$f":"IFERROR(VLOOKUP(MID(J18,1,SEARCH(\"-\",J18,1)-2),'Codici COIN'!$C$16:$J$27,8,FALSE),\"\")","v":5},"1513 - Apparecchi e utensili d'eserciz.",5000,null,5000,1000,0,"4421.30",1.0833333333333335,"Sì",12,{"$f":"IF(R18<>\"Sì\",0,IF(J18='Codici COIN'!$I$17,M18,IF(Q18=0,1,IF(H18>0,M18*Q18/I18,0))))","v":1083.3333333333335},0,{"$f":"IF(AND(T18=1,S18=0),0,IF(J18='Codici COIN'!$I$17,M18,M18/2))","v":2500},{"$f":"V18*Parametri!$B$13*S18/12","v":92.5},0,null,null,null,"","Acquisito piccola lavatrice AEG per 2°piano. Finanziamento 100% Fondo 3",1092.5,874,218.5,0,0,5000,null,null,null,5000,0,0,0,0,null,{"$f":"SUM(Tabella1[[#This Row],[Contributi dei Comuni (6900)]:[Contributi di Enti privati (fondaz., associaz., coop., SA, donazioni) (6970)]])-Tabella1[[#This Row],[Finanziamento totale]]","v":0}]
["1513-02",1,"Nuova idropultricie",null,"Magazzino","Kärcher SA","042 - Pulizia","2020-03-01",{"$f":"IFERROR(VLOOKUP(MID(J19,1,SEARCH(\"-\",J19,1)-2),'Codici COIN'!$C$16:$J$27,8,FALSE),\"\")","v":5},"1513 - Apparecchi e utensili d'eserciz.",5500,null,5500,1100,0,"4421.30",3.166666666666667,"Sì",12,{"$f":"IF(R19<>\"Sì\",0,IF(J19='Codici COIN'!$I$17,M19,IF(Q19=0,1,IF(H19>0,M19*Q19/I19,0))))","v":3483.3333333333335},0,{"$f":"IF(AND(T19=1,S19=0),0,IF(J19='Codici COIN'!$I$17,M19,M19/2))","v":2750},{"$f":"V19*Parametri!$B$13*S19/12","v":101.75},0,null,null,null,"","Acquisto Idropultricie aziendale Kärcher. Finanziamento 100% Fondo 3",1201.75,961.4,240.35,0,0,5500,null,null,null,5500,0,0,0,0,null,{"$f":"SUM(Tabella1[[#This Row],[Contributi dei Comuni (6900)]:[Contributi di Enti privati (fondaz., associaz., coop., SA, donazioni) (6970)]])-Tabella1[[#This Row],[Finanziamento totale]]","v":0}]
["1510-03",1,"Nuova cucina industriale",null,"Cucina","Miele AG","060 - Cucina","2016-02-01",{"$f":"IFERROR(VLOOKUP(MID(J20,1,SEARCH(\"-\",J20,1)-2),'Codici COIN'!$C$16:$J$27,8,FALSE),\"\")","v":10},"1510 - Mobilio, macch. industriali",38000,null,38000,3800,0,"4421.00",4.083333333333333,"Sì",12,{"$f":"IF(R20<>\"Sì\",0,IF(J20='Codici COIN'!$I$17,M20,IF(Q20=0,1,IF(H20>0,M20*Q20/I20,0))))","v":15516.666666666666},0,{"$f":"IF(AND(T20=1,S20=0),0,IF(J20='Codici COIN'!$I$17,M20,M20/2))","v":19000},{"$f":"V20*Parametri!$B$13*S20/12","v":703},0,null,null,null,"","Sostituzione completa cucina industriale Miele. Finanziamento 100% Fondo 3",4503,3602.3999999999996,900.59999999999991,0,0,38000,null,null,null,38000,0,0,0,0,null,{"$f":"SUM(Tabella1[[#This Row],[Contributi dei Comuni (6900)]:[Contributi di Enti privati (fondaz., associaz., coop., SA, donazioni) (6970)]])-Tabella1[[#This Row],[Finanziamento totale]]","v":0}]
["1510-04",1,"Nuovo armadio-dispensario medicamenti",null,"Farmacia","Medlab SA","095 - Farmacia","2017-06-01",{"$f":"IFERROR(VLOOKUP(MID(J21,1,SEARCH(\"-\",J21,1)-2),'Codici COIN'!$C$16:$J$27,8,FALSE),\"\")","v":10},"1510 - Mobilio, macch. industriali",12000,null,12000,1200,0,"4421.00",5.416666666666667,"Sì",12,{"$f":"IF(R21<>\"Sì\",0,IF(J21='Codici COIN'!$I$17,M21,IF(Q21=0,1,IF(H21>0,M21*Q21/I21,0))))","v":6500},0,{"$f":"IF(AND(T21=1,S21=0),0,IF(J21='Codici COIN'!$I$17,M21,M21/2))","v":6000},{"$f":"V21*Parametri!$B$13*S21/12","v":222},0,null,null,null,"","Nuovo armadio-dispensario medicamenti.  Finanziamento 100% Fondo 3",1422,1137.5999999999999,284.39999999999998,0,0,12000,null,null,null,12000,0,0,0,0,null,{"$f":"SUM(Tabella1[[#This Row],[Contributi dei Comuni (6900)]:[Contributi di Enti privati (fondaz., associaz., coop., SA, donazioni) (6970)]])-Tabella1[[#This Row],[Finanziamento totale]]","v":0}]
["1510-05",30,"Acquisito nuovi letti medicali (tranche 1)",null,"CPA 1° piano","Medlab SA","100 - Servizio alberghiero","2018-01-01",{"$f":"IFERROR(VLOOKUP(MID(J22,1,SEARCH(\"-\",J22,1)-2),'Codici COIN'!$C$16:$J$27,8,FALSE),\"\")","v":10},"1510 - Mobilio, macch. industriali",2000,null,60000,6000,0,"4421.00",6,"Sì",12,{"$f":"IF(R22<>\"Sì\",0,IF(J22='Codici COIN'!$I$17,M22,IF(Q22=0,1,IF(H22>0,M22*Q22/I22,0))))","v":36000},0,{"$f":"IF(AND(T22=1,S22=0),0,IF(J22='Codici COIN'!$I$17,M22,M22/2))","v":30000},{"$f":"V22*Parametri!$B$13*S22/12","v":1110},0,null,null,null,"","Acquisito nuovi 30x letti medicali (tranche 1). Finanziamento all'investimento Lanz 50% e 50% Fondo 3",7110,2844,4266,0,0,60000,null,30000,null,30000,0,0,3000,0,null,{"$f":"SUM(Tabella1[[#This Row],[Contributi dei Comuni (6900)]:[Contributi di Enti privati (fondaz., associaz., coop., SA, donazioni) (6970)]])-Tabella1[[#This Row],[Finanziamento totale]]","v":0}]
["1510-06",30,"Acquisito nuovi letti medicali (tranche 2)",null,"CPA 2° piano","Medlab SA","100 - Servizio alberghiero","2019-01-01",{"$f":"IFERROR(VLOOKUP(MID(J23,1,SEARCH(\"-\",J23,1)-2),'Codici COIN'!$C$16:$J$27,8,FALSE),\"\")","v":10},"1510 - Mobilio, macch. industriali",2000,null,60000,6000,0,"4421.00",7,"Sì",12,{"$f":"IF(R23<>\"Sì\",0,IF(J23='Codici COIN'!$I$17,M23,IF(Q23=0,1,IF(H23>0,M23*Q23/I23,0))))","v":42000},0,{"$f":"IF(AND(T23=1,S23=0),0,IF(J23='Codici COIN'!$I$17,M23,M23/2))","v":30000},{"$f":"V23*Parametri!$B$13*S23/12","v":1110},0,null,null,null,"","Acquisito nuovi 30x letti medicali (tranche 2). Finanziamento all'investimento Lanz 50% e 50% Fondo 3",7110,2844,4266,0,0,60000,null,30000,null,30000,0,0,3000,0,null,{"$f":"SUM(Tabella1[[#This Row],[Contributi dei Comuni (6900)]:[Contributi di Enti privati (fondaz., associaz., coop., SA, donazioni) (6970)]])-Tabella1[[#This Row],[Finanziamento totale]]","v":0}]
["1501-03",1,"Formazione nuova sala attività d'animazione",null,"Sala animazione","diversi","110 - Animazione (Assistenza non LAMal)","2011-04-01",{"$f":"IFERROR(VLOOKUP(MID(J24,1,SEARCH(\"-\",J24,1)-2),'Codici COIN'!$C$16:$J$27,8,FALSE),\"\")","v":33},"1501 - Edifici",70000,null,70000,2121.212121212121,0,"4420.10",22.25,"Sì",12,{"$f":"IF(R24<>\"Sì\",0,IF(J24='Codici COIN'!$I$17,M24,IF(Q24=0,1,IF(H24>0,M24*Q24/I24,0))))","v":47196.969696969696},0,{"$f":"IF(AND(T24=1,S24=0),0,IF(J24='Codici COIN'!$I$17,M24,M24/2))","v":35000},{"$f":"V24*Parametri!$B$13*S24/12","v":1295},0,null,null,null,"","Formazione nuova sala attività d'animazione. Finanziamento investimento LANz 30%, Fondo 30% e 40% donazione privata \"ad hoc\"",3416.212121212121,819.89090909090908,1229.8363636363636,0,1366.4848484848485,70000,null,21000,null,21000,28000,0,636.36363636363626,0,null,{"$f":"SUM(Tabella1[[#This Row],[Contributi dei Comuni (6900)]:[Contributi di Enti privati (fondaz., associaz., coop., SA, donazioni) (6970)]])-Tabella1[[#This Row],[Finanziamento totale]]","v":0}]
["1516-01",1,"Nuovo strumento RAI-Rugs ",null,null,"Q-Sys AG","115 - Cure LAMal","2019-06-01",{"$f":"IFERROR(VLOOKUP(MID(J25,1,SEARCH(\"-\",J25,1)-2),'Codici COIN'!$C$16:$J$27,8,FALSE),\"\")","v":4},"1515/16 - Hard e software",35000,null,{"$f":"B25*K25+L25","v":35000},8750,0,"4421.60",1.4166666666666665,"Sì",12,{"$f":"IF(R25<>\"Sì\",0,IF(J25='Codici COIN'!$I$17,M25,IF(Q25=0,1,IF(H25>0,M25*Q25/I25,0))))","v":12395.833333333332},0,{"$f":"IF(AND(T25=1,S25=0),0,IF(J25='Codici COIN'!$I$17,M25,M25/2))","v":17500},{"$f":"V25*Parametri!$B$13*S25/12","v":647.5},0,null,null,null,"","Nuovo strumento RAI-RUGs. Finanziamento all'investimento LAnz 50% e 50% Fondo 3",9397.5,3759.0000000000005,5638.5,0,0,35000,null,17500,null,17500,0,0,4375,0,null,{"$f":"SUM(Tabella1[[#This Row],[Contributi dei Comuni (6900)]:[Contributi di Enti privati (fondaz., associaz., coop., SA, donazioni) (6970)]])-Tabella1[[#This Row],[Finanziamento totale]]","v":0}]
["1514-01",3,"Sollevatori",null,"CPA ai piani","Medlab SA","100 - Servizio alberghiero","2018-05-01",{"$f":"IFERROR(VLOOKUP(MID(J26,1,SEARCH(\"-\",J26,1)-2),'Codici COIN'!$C$16:$J$27,8,FALSE),\"\")","v":8},"1514 - Apparecchiature medico-tecniche",5000,null,15000,1875,0,"4421.40",4.3333333333333339,"Sì",12,{"$f":"IF(R26<>\"Sì\",0,IF(J26='Codici COIN'!$I$17,M26,IF(Q26=0,1,IF(H26>0,M26*Q26/I26,0))))","v":8125.0000000000009},0,{"$f":"IF(AND(T26=1,S26=0),0,IF(J26='Codici COIN'!$I$17,M26,M26/2))","v":7500},{"$f":"V26*Parametri!$B$13*S26/12","v":277.5},0,null,null,null,"","Nuovi sollevatori ai piani. Finanziamento 100% Fondo 3",2152.5,1721.9999999999998,430.49999999999994,0,0,15000,null,null,null,15000,0,0,0,0,null,{"$f":"SUM(Tabella1[[#This Row],[Contributi dei Comuni (6900)]:[Contributi di Enti privati (fondaz., associaz., coop., SA, donazioni) (6970)]])-Tabella1[[#This Row],[Finanziamento totale]]","v":0}]
["1514-02",1,"Nuove macchine fisio- e ergoterapia",null,"Sala Fisio- e Ergoterapia","Fisiotec AG","130 - Fisioterapia","2021-10-01",{"$f":"IFERROR(VLOOKUP(MID(J27,1,SEARCH(\"-\",J27,1)-2),'Codici COIN'!$C$16:$J$27,8,FALSE),\"\")","v":8},"1514 - Apparecchiature medico-tecniche",12000,null,12000,375,0,"4421.40",7.75,"Sì",3,{"$f":"IF(R27<>\"Sì\",0,IF(J27='Codici COIN'!$I$17,M27,IF(Q27=0,1,IF(H27>0,M27*Q27/I27,0))))","v":11625},0,{"$f":"IF(AND(T27=1,S27=0),0,IF(J27='Codici COIN'!$I$17,M27,M27/2))","v":6000},{"$f":"V27*Parametri!$B$13*S27/12","v":55.5},0,null,null,null,"","Nuove macchine per fisio- e ergoterapia. Finanziamento 100% Fondo 3",430.5,344.4,86.1,0,0,12000,null,null,null,12000,0,0,0,0,null,{"$f":"SUM(Tabella1[[#This Row],[Contributi dei Comuni (6900)]:[Contributi di Enti privati (fondaz., associaz., coop., SA, donazioni) (6970)]])-Tabella1[[#This Row],[Finanziamento totale]]","v":0}]
["X",1,"Avvio progetto ampliamento CPA - Studio di fattibilità",null,null,"Arch. Perfetto Sagl","030 - Direzione e amministrazione","2021-03-01",1,"Progetti in corso",80000,null,80000,66666.666666666672,0,"-",0.16666666666666663,"Sì",10,{"$f":"IF(R28<>\"Sì\",0,IF(J28='Codici COIN'!$I$17,M28,IF(Q28=0,1,IF(H28>0,M28*Q28/I28,0))))","v":13333.33333333333},0,{"$f":"IF(AND(T28=1,S28=0),0,IF(J28='Codici COIN'!$I$17,M28,M28/2))","v":40000},{"$f":"V28*Parametri!$B$13*S28/12","v":1233.3333333333333},0,1000,null,null,"","Avvio progetto ampliamento CPA, studio di fattibilità. Finanz. a carico della proprietà. Costo ca. CHF 80'000.- (non ancora pagati). Inserito nel 2021 solo CHF 1.- nel Bilancio dell'Ente proprietario.",67900,0,0,0,67900,80000,null,null,null,null,80000,0,0,0,null,{"$f":"SUM(Tabella1[[#This Row],[Contributi dei Comuni (6900)]:[Contributi di Enti privati (fondaz., associaz., coop., SA, donazioni) (6970)]])-Tabella1[[#This Row],[Finanziamento totale]]","v":0}]
["1510-07",80,"Nuovo mobilio per camere ospiti",null,"Piani CPA","Medlab SA","100 - Servizio alberghiero","2021-11-01",{"$f":"IFERROR(VLOOKUP(MID(J29,1,SEARCH(\"-\",J29,1)-2),'Codici COIN'!$C$16:$J$27,8,FALSE),\"\")","v":10},"1510 - Mobilio, macch. industriali",250,null,20000,333.33333333333331,0,null,9.8333333333333339,"Sì",2,{"$f":"IF(R29<>\"Sì\",0,IF(J29='Codici COIN'!$I$17,M29,IF(Q29=0,1,IF(H29>0,M29*Q29/I29,0))))","v":19666.666666666668},0,{"$f":"IF(AND(T29=1,S29=0),0,IF(J29='Codici COIN'!$I$17,M29,M29/2))","v":10000},{"$f":"V29*Parametri!$B$13*S29/12","v":61.666666666666664},0,null,null,null,"","Acquisito nuovo arredo per camere (80x mobiletti+sedie). Finanziamento 100% Fondo 3",395,316,79,0,0,20000,null,null,null,20000,0,0,0,0,null,{"$f":"SUM(Tabella1[[#This Row],[Contributi dei Comuni (6900)]:[Contributi di Enti privati (fondaz., associaz., coop., SA, donazioni) (6970)]])-Tabella1[[#This Row],[Finanziamento totale]]","v":0}]
["1501-04",1,"Formazione Nuovo Reparto CAT-STT da ala CPA in disuso",null,"Via Locarno 100, 6500 Bellinzona","diversi","160 - Cure acute transitorie (CAT)","2015-01-01",{"$f":"IFERROR(VLOOKUP(MID(J30,1,SEARCH(\"-\",J30,1)-2),'Codici COIN'!$C$16:$J$27,8,FALSE),\"\")","v":33},"1501 - Edifici",1500000,null,1500000,45454.545454545449,0,null,26,"Sì",12,{"$f":"IF(R30<>\"Sì\",0,IF(J30='Codici COIN'!$I$17,M30,IF(Q30=0,1,IF(H30>0,M30*Q30/I30,0))))","v":1181818.1818181819},0,{"$f":"IF(AND(T30=1,S30=0),0,IF(J30='Codici COIN'!$I$17,M30,M30/2))","v":750000},{"$f":"V30*Parametri!$B$13*S30/12","v":27750},0,null,null,null,"","Ristrutturazione vecchia ala CPA e formazione nuovo Reparto CAT-STT. Finanziamento interamente assunto dal Cantone !",73204.545454545441,0,73204.545454545441,0,0,1500000,null,1500000,null,null,0,0,45454.545454545449,0,null,{"$f":"SUM(Tabella1[[#This Row],[Contributi dei Comuni (6900)]:[Contributi di Enti privati (fondaz., associaz., coop., SA, donazioni) (6970)]])-Tabella1[[#This Row],[Finanziamento totale]]","v":0}]
[null,null,null,null,null,null,null,null,{"$f":"IFERROR(VLOOKUP(MID(J31,1,SEARCH(\"-\",J31,1)-2),'Codici COIN'!$C$16:$J$27,8,FALSE),\"\")","v":""},null,null,null,0,0,0,null,0,"",0,{"$f":"IF(R31<>\"Sì\",0,IF(J31='Codici COIN'!$I$17,M31,IF(Q31=0,1,IF(H31>0,M31*Q31/I31,0))))","v":0},0,{"$f":"IF(AND(T31=1,S31=0),0,IF(J31='Codici COIN'!$I$17,M31,M31/2))","v":0},{"$f":"V31*Parametri!$B$13*S31/12","v":0},0,null,null,null,"",null,0,0,0,0,0,0,null,null,null,null,0,0,0,0,null,{"$f":"SUM(Tabella1[[#This Row],[Contributi dei Comuni (6900)]:[Contributi di Enti privati (fondaz., associaz., coop., SA, donazioni) (6970)]])-Tabella1[[#This Row],[Finanziamento totale]]","v":0}]
[null,null,null,null,null,null,null,null,{"$f":"IFERROR(VLOOKUP(MID(J32,1,SEARCH(\"-\",J32,1)-2),'Codici COIN'!$C$16:$J$27,8,FALSE),\"\")","v":""},null,null,null,0,0,0,null,0,"",0,{"$f":"IF(R32<>\"Sì\",0,IF(J32='Codici COIN'!$I$17,M32,IF(Q32=0,1,IF(H32>0,M32*Q32/I32,0))))","v":0},0,{"$f":"IF(AND(T32=1,S32=0),0,IF(J32='Codici COIN'!$I$17,M32,M32/2))","v":0},{"$f":"V32*Parametri!$B$13*S32/12","v":0},0,null,null,null,"",null,0,0,0,0,0,0,null,null,null,null,0,0,0,0,null,{"$f":"SUM(Tabella1[[#This Row],[Contributi dei Comuni (6900)]:[Contributi di Enti privati (fondaz., associaz., coop., SA, donazioni) (6970)]])-Tabella1[[#This Row],[Finanziamento totale]]","v":0}]
[null,null,null,null,null,null,null,null,{"$f":"IFERROR(VLOOKUP(MID(J33,1,SEARCH(\"-\",J33,1)-2),'Codici COIN'!$C$16:$J$27,8,FALSE),\"\")","v":""},null,null,null,0,0,0,null,0,"",0,{"$f":"IF(R33<>\"Sì\",0,IF(J33='Codici COIN'!$I$17,M33,IF(Q33=0,1,IF(H33>0,M33*Q33/I33,0))))","v":0},0,{"$f":"IF(AND(T33=1,S33=0),0,IF(J33='Codici COIN'!$I$17,M33,M33/2))","v":0},{"$f":"V33*Parametri!$B$13*S33/12","v":0},0,null,null,null,"",null,0,0,0,0,0,0,null,null,null,null,0,0,0,0,null,{"$f":"SUM(Tabella1[[#This Row],[Contributi dei Comuni (6900)]:[Contributi di Enti privati (fondaz., associaz., coop., SA, donazioni) (6970)]])-Tabella1[[#This Row],[Finanziamento totale]]","v":0}]
[null,null,null,null,null,null,null,null,{"$f":"IFERROR(VLOOKUP(MID(J34,1,SEARCH(\"-\",J34,1)-2),'Codici COIN'!$C$16:$J$27,8,FALSE),\"\")","v":""},null,null,null,0,0,0,null,0,"",0,{"$f":"IF(R34<>\"Sì\",0,IF(J34='Codici COIN'!$I$17,M34,IF(Q34=0,1,IF(H34>0,M34*Q34/I34,0))))","v":0},0,{"$f":"IF(AND(T34=1,S34=0),0,IF(J34='Codici COIN'!$I$17,M34,M34/2))","v":0},{"$f":"V34*Parametri!$B$13*S34/12","v":0},0,null,null,null,"",null,0,0,0,0,0,0,null,null,null,null,0,0,0,0,null,{"$f":"SUM(Tabella1[[#This Row],[Contributi dei Comuni (6900)]:[Contributi di Enti privati (fondaz., associaz., coop., SA, donazioni) (6970)]])-Tabella1[[#This Row],[Finanziamento totale]]","v":0}]
[null,null,null,null,null,null,null,null,{"$f":"IFERROR(VLOOKUP(MID(J35,1,SEARCH(\"-\",J35,1)-2),'Codici COIN'!$C$16:$J$27,8,FALSE),\"\")","v":""},null,null,null,0,0,0,null,0,"",0,{"$f":"IF(R35<>\"Sì\",0,IF(J35='Codici COIN'!$I$17,M35,IF(Q35=0,1,IF(H35>0,M35*Q35/I35,0))))","v":0},0,{"$f":"IF(AND(T35=1,S35=0),0,IF(J35='Codici COIN'!$I$17,M35,M35/2))","v":0},{"$f":"V35*Parametri!$B$13*S35/12","v":0},0,null,null,null,"",null,0,0,0,0,0,0,null,null,null,null,0,0,0,0,null,{"$f":"SUM(Tabella1[[#This Row],[Contributi dei Comuni (6900)]:[Contributi di Enti privati (fondaz., associaz., coop., SA, donazioni) (6970)]])-Tabella1[[#This Row],[Finanziamento totale]]","v":0}]
[null,null,null,null,null,null,null,null,{"$f":"IFERROR(VLOOKUP(MID(J36,1,SEARCH(\"-\",J36,1)-2),'Codici COIN'!$C$16:$J$27,8,FALSE),\"\")","v":""},null,null,null,0,0,0,null,0,"",0,{"$f":"IF(R36<>\"Sì\",0,IF(J36='Codici COIN'!$I$17,M36,IF(Q36=0,1,IF(H36>0,M36*Q36/I36,0))))","v":0},0,{"$f":"IF(AND(T36=1,S36=0),0,IF(J36='Codici COIN'!$I$17,M36,M36/2))","v":0},{"$f":"V36*Parametri!$B$13*S36/12","v":0},0,null,null,null,"",null,0,0,0,0,0,0,null,null,null,null,0,0,0,0,null,{"$f":"SUM(Tabella1[[#This Row],[Contributi dei Comuni (6900)]:[Contributi di Enti privati (fondaz., associaz., coop., SA, donazioni) (6970)]])-Tabella1[[#This Row],[Finanziamento totale]]","v":0}]
[null,null,null,null,null,null,null,null,{"$f":"IFERROR(VLOOKUP(MID(J37,1,SEARCH(\"-\",J37,1)-2),'Codici COIN'!$C$16:$J$27,8,FALSE),\"\")","v":""},null,null,null,0,0,0,null,0,"",0,{"$f":"IF(R37<>\"Sì\",0,IF(J37='Codici COIN'!$I$17,M37,IF(Q37=0,1,IF(H37>0,M37*Q37/I37,0))))","v":0},0,{"$f":"IF(AND(T37=1,S37=0),0,IF(J37='Codici COIN'!$I$17,M37,M37/2))","v":0},{"$f":"V37*Parametri!$B$13*S37/12","v":0},0,null,null,null,"",null,0,0,0,0,0,0,null,null,null,null,0,0,0,0,null,{"$f":"SUM(Tabella1[[#This Row],[Contributi dei Comuni (6900)]:[Contributi di Enti privati (fondaz., associaz., coop., SA, donazioni) (6970)]])-Tabella1[[#This Row],[Finanziamento totale]]","v":0}]
[null,null,null,null,null,null,null,null,{"$f":"IFERROR(VLOOKUP(MID(J38,1,SEARCH(\"-\",J38,1)-2),'Codici COIN'!$C$16:$J$27,8,FALSE),\"\")","v":""},null,null,null,0,0,{"$f":"N38*Z38","v":0},null,0,{"$f":"IF(H38<=0,\"\",IF(AA38>0,\"No, dismesso\",\"Sì\"))","v":""},0,{"$f":"IF(R38<>\"Sì\",0,IF(J38='Codici COIN'!$I$17,M38,IF(Q38=0,1,IF(H38>0,M38*Q38/I38,0))))","v":0},{"$f":"+T38*Z38","v":0},{"$f":"IF(AND(T38=1,S38=0),0,IF(J38='Codici COIN'!$I$17,M38,M38/2))","v":0},{"$f":"V38*Parametri!$B$13*S38/12","v":0},{"$f":"IF(V38>0,W38*Z38,0)","v":0},null,null,null,{"$f":"IF(AA38>0,IF(I38=\"n/a\",M38,MAX(0,(I38-(DATEDIF(H38,AA38,\"M\")+1)/12)*M38/I38)),\"\")","v":""},null,{"$f":"N38+W38","v":0},{"$f":"IF($M38>0,($AD38/$M38)*(AJ38+80%*$AM38),0)","v":0},{"$f":"IF($M38>0,($AD38/$M38)*(AK38+20%*$AM38),0)","v":0},{"$f":"IF($M38>0,($AD38/$M38)*(AL38),0)","v":0},{"$f":"IF($M38>0,($AD38/$M38)*AN38,0)","v":0},{"$f":"M38","v":0},null,null,null,null,0,{"$f":"IF(M38>0,$N38/$M38*AJ38,0)","v":0},{"$f":"IF(M38>0,$N38/$M38*AK38,0)","v":0},{"$f":"IF(M38>0,$N38/$M38*AL38,0)","v":0},null,{"$f":"SUM(Tabella1[[#This Row],[Contributi dei Comuni (6900)]:[Contributi di Enti privati (fondaz., associaz., coop., SA, donazioni) (6970)]])-Tabella1[[#This Row],[Finanziamento totale]]","v":0}]
[null,null,null,null,null,null,null,null,{"$f":"IFERROR(VLOOKUP(MID(J39,1,SEARCH(\"-\",J39,1)-2),'Codici COIN'!$C$16:$J$27,8,FALSE),\"\")","v":""},null,null,null,0,0,0,null,{"$f":"IF(OR(I39=\"n/a\",H39=0),0,MAX(I39-(DATEDIF(H39,$G$2,\"M\")+1)/12,0))","v":0},"",{"$f":"IF(H39=0,0,IF(R39=\"Sì\",IF(YEAR(H39)=YEAR($G$2),12-MONTH(H39)+1,IF(YEAR(H39)+IF(I39=\"n/a\",999,I39)=YEAR($G$2),MONTH(H39)-1,IF(YEAR(H39)+IF(I39=\"n/a\",999,I39)<YEAR($G$2),0,12))),IF(AND(AA39>0,YEAR(AA39)<YEAR($G$2)),0,MAX(0,MIN(MONTH(AA39),IF(I39=\"n/a\",999,I39)*12-DATEDIF(H39,DATE(YEAR($G$2),1,1),\"M\"))))))","v":0},{"$f":"IF(R39<>\"Sì\",0,IF(J39='Codici COIN'!$I$17,M39,IF(Q39=0,1,IF(H39>0,M39*Q39/I39,0))))","v":0},0,{"$f":"IF(AND(T39=1,S39=0),0,IF(J39='Codici COIN'!$I$17,M39,M39/2))","v":0},{"$f":"V39*Parametri!$B$13*S39/12","v":0},0,null,null,null,"",null,0,0,0,0,0,0,null,null,null,null,0,0,0,0,null,{"$f":"SUM(Tabella1[[#This Row],[Contributi dei Comuni (6900)]:[Contributi di Enti privati (fondaz., associaz., coop., SA, donazioni) (6970)]])-Tabella1[[#This Row],[Finanziamento totale]]","v":0}]
[null,null,null,null,null,null,null,null,{"$f":"IFERROR(VLOOKUP(MID(J40,1,SEARCH(\"-\",J40,1)-2),'Codici COIN'!$C$16:$J$27,8,FALSE),\"\")","v":""},null,null,null,0,0,0,null,0,"",0,{"$f":"IF(R40<>\"Sì\",0,IF(J40='Codici COIN'!$I$17,M40,IF(Q40=0,1,IF(H40>0,M40*Q40/I40,0))))","v":0},0,{"$f":"IF(AND(T40=1,S40=0),0,IF(J40='Codici COIN'!$I$17,M40,M40/2))","v":0},{"$f":"V40*Parametri!$B$13*S40/12","v":0},0,null,null,null,"",null,0,0,0,0,0,0,null,null,null,null,0,0,0,0,null,{"$f":"SUM(Tabella1[[#This Row],[Contributi dei Comuni (6900)]:[Contributi di Enti privati (fondaz., associaz., coop., SA, donazioni) (6970)]])-Tabella1[[#This Row],[Finanziamento totale]]","v":0}]
[null,null,null,null,null,null,null,null,{"$f":"IFERROR(VLOOKUP(MID(J41,1,SEARCH(\"-\",J41,1)-2),'Codici COIN'!$C$16:$J$27,8,FALSE),\"\")","v":""},null,null,null,0,0,0,null,0,"",0,{"$f":"IF(R41<>\"Sì\",0,IF(J41='Codici COIN'!$I$17,M41,IF(Q41=0,1,IF(H41>0,M41*Q41/I41,0))))","v":0},0,{"$f":"IF(AND(T41=1,S41=0),0,IF(J41='Codici COIN'!$I$17,M41,M41/2))","v":0},{"$f":"V41*Parametri!$B$13*S41/12","v":0},0,null,null,null,"",null,0,0,0,0,0,0,null,null,null,null,0,0,0,0,null,{"$f":"SUM(Tabella1[[#This Row],[Contributi dei Comuni (6900)]:[Contributi di Enti privati (fondaz., associaz., coop., SA, donazioni) (6970)]])-Tabella1[[#This Row],[Finanziamento totale]]","v":0}]
[null,null,null,null,null,null,null,null,{"$f":"IFERROR(VLOOKUP(MID(J42,1,SEARCH(\"-\",J42,1)-2),'Codici COIN'!$C$16:$J$27,8,FALSE),\"\")","v":""},null,null,null,0,0,0,null,0,"",0,{"$f":"IF(R42<>\"Sì\",0,IF(J42='Codici COIN'!$I$17,M42,IF(Q42=0,1,IF(H42>0,M42*Q42/I42,0))))","v":0},0,{"$f":"IF(AND(T42=1,S42=0),0,IF(J42='Codici COIN'!$I$17,M42,M42/2))","v":0},{"$f":"V42*Parametri!$B$13*S42/12","v":0},0,null,null,null,"",null,0,0,0,0,0,0,null,null,null,null,0,0,0,0,null,{"$f":"SUM(Tabella1[[#This Row],[Contributi dei Comuni (6900)]:[Contributi di Enti privati (fondaz., associaz., coop., SA, donazioni) (6970)]])-Tabella1[[#This Row],[Finanziamento totale]]","v":0}]
[null,null,null,null,null,null,null,null,{"$f":"IFERROR(VLOOKUP(MID(J43,1,SEARCH(\"-\",J43,1)-2),'Codici COIN'!$C$16:$J$27,8,FALSE),\"\")","v":""},null,null,null,0,0,0,null,0,"",0,{"$f":"IF(R43<>\"Sì\",0,IF(J43='Codici COIN'!$I$17,M43,IF(Q43=0,1,IF(H43>0,M43*Q43/I43,0))))","v":0},0,{"$f":"IF(AND(T43=1,S43=0),0,IF(J43='Codici COIN'!$I$17,M43,M43/2))","v":0},{"$f":"V43*Parametri!$B$13*S43/12","v":0},0,null,null,null,"",null,0,0,0,0,0,0,null,null,null,null,0,0,0,0,null,{"$f":"SUM(Tabella1[[#This Row],[Contributi dei Comuni (6900)]:[Contributi di Enti privati (fondaz., associaz., coop., SA, donazioni) (6970)]])-Tabella1[[#This Row],[Finanziamento totale]]","v":0}]
[null,null,null,null,null,null,null,null,{"$f":"IFERROR(VLOOKUP(MID(J44,1,SEARCH(\"-\",J44,1)-2),'Codici COIN'!$C$16:$J$27,8,FALSE),\"\")","v":""},null,null,null,0,0,0,null,0,"",0,{"$f":"IF(R44<>\"Sì\",0,IF(J44='Codici COIN'!$I$17,M44,IF(Q44=0,1,IF(H44>0,M44*Q44/I44,0))))","v":0},0,{"$f":"IF(AND(T44=1,S44=0),0,IF(J44='Codici COIN'!$I$17,M44,M44/2))","v":0},{"$f":"V44*Parametri!$B$13*S44/12","v":0},0,null,null,null,"",null,0,0,0,0,0,0,null,null,null,null,0,0,0,0,null,{"$f":"SUM(Tabella1[[#This Row],[Contributi dei Comuni (6900)]:[Contributi di Enti privati (fondaz., associaz., coop., SA, donazioni) (6970)]])-Tabella1[[#This Row],[Finanziamento totale]]","v":0}]
[null,null,null,null,null,null,null,null,{"$f":"IFERROR(VLOOKUP(MID(J45,1,SEARCH(\"-\",J45,1)-2),'Codici COIN'!$C$16:$J$27,8,FALSE),\"\")","v":""},null,null,null,0,0,0,null,0,"",0,{"$f":"IF(R45<>\"Sì\",0,IF(J45='Codici COIN'!$I$17,M45,IF(Q45=0,1,IF(H45>0,M45*Q45/I45,0))))","v":0},0,{"$f":"IF(AND(T45=1,S45=0),0,IF(J45='Codici COIN'!$I$17,M45,M45/2))","v":0},{"$f":"V45*Parametri!$B$13*S45/12","v":0},0,null,null,null,"",null,0,0,0,0,0,0,null,null,null,null,0,0,0,0,null,{"$f":"SUM(Tabella1[[#This Row],[Contributi dei Comuni (6900)]:[Contributi di Enti privati (fondaz., associaz., coop., SA, donazioni) (6970)]])-Tabella1[[#This Row],[Finanziamento totale]]","v":0}]
[null,null,null,null,null,null,null,null,{"$f":"IFERROR(VLOOKUP(MID(J46,1,SEARCH(\"-\",J46,1)-2),'Codici COIN'!$C$16:$J$27,8,FALSE),\"\")","v":""},null,null,null,0,0,0,null,0,"",0,{"$f":"IF(R46<>\"Sì\",0,IF(J46='Codici COIN'!$I$17,M46,IF(Q46=0,1,IF(H46>0,M46*Q46/I46,0))))","v":0},0,{"$f":"IF(AND(T46=1,S46=0),0,IF(J46='Codici COIN'!$I$17,M46,M46/2))","v":0},{"$f":"V46*Parametri!$B$13*S46/12","v":0},0,null,null,null,"",null,0,0,0,0,0,0,null,null,null,null,0,0,0,0,null,{"$f":"SUM(Tabella1[[#This Row],[Contributi dei Comuni (6900)]:[Contributi di Enti privati (fondaz., associaz., coop., SA, donazioni) (6970)]])-Tabella1[[#This Row],[Finanziamento totale]]","v":0}]
[null,null,null,null,null,null,null,null,{"$f":"IFERROR(VLOOKUP(MID(J47,1,SEARCH(\"-\",J47,1)-2),'Codici COIN'!$C$16:$J$27,8,FALSE),\"\")","v":""},null,null,null,0,0,0,null,0,"",0,{"$f":"IF(R47<>\"Sì\",0,IF(J47='Codici COIN'!$I$17,M47,IF(Q47=0,1,IF(H47>0,M47*Q47/I47,0))))","v":0},0,{"$f":"IF(AND(T47=1,S47=0),0,IF(J47='Codici COIN'!$I$17,M47,M47/2))","v":0},{"$f":"V47*Parametri!$B$13*S47/12","v":0},0,null,null,null,"",null,0,0,0,0,0,0,null,null,null,null,0,0,0,0,null,{"$f":"SUM(Tabella1[[#This Row],[Contributi dei Comuni (6900)]:[Contributi di Enti privati (fondaz., associaz., coop., SA, donazioni) (6970)]])-Tabella1[[#This Row],[Finanziamento totale]]","v":0}]
[null,null,null,null,null,null,null,null,{"$f":"IFERROR(VLOOKUP(MID(J48,1,SEARCH(\"-\",J48,1)-2),'Codici COIN'!$C$16:$J$27,8,FALSE),\"\")","v":""},null,null,null,0,0,0,null,0,"",0,{"$f":"IF(R48<>\"Sì\",0,IF(J48='Codici COIN'!$I$17,M48,IF(Q48=0,1,IF(H48>0,M48*Q48/I48,0))))","v":0},0,{"$f":"IF(AND(T48=1,S48=0),0,IF(J48='Codici COIN'!$I$17,M48,M48/2))","v":0},{"$f":"V48*Parametri!$B$13*S48/12","v":0},0,null,null,null,"",null,0,0,0,0,0,0,null,null,null,null,0,0,0,0,null,{"$f":"SUM(Tabella1[[#This Row],[Contributi dei Comuni (6900)]:[Contributi di Enti privati (fondaz., associaz., coop., SA, donazioni) (6970)]])-Tabella1[[#This Row],[Finanziamento totale]]","v":0}]
[null,null,null,null,null,null,null,null,{"$f":"IFERROR(VLOOKUP(MID(J49,1,SEARCH(\"-\",J49,1)-2),'Codici COIN'!$C$16:$J$27,8,FALSE),\"\")","v":""},null,null,null,0,0,0,null,0,"",0,{"$f":"IF(R49<>\"Sì\",0,IF(J49='Codici COIN'!$I$17,M49,IF(Q49=0,1,IF(H49>0,M49*Q49/I49,0))))","v":0},0,{"$f":"IF(AND(T49=1,S49=0),0,IF(J49='Codici COIN'!$I$17,M49,M49/2))","v":0},{"$f":"V49*Parametri!$B$13*S49/12","v":0},0,null,null,null,"",null,0,0,0,0,0,0,null,null,null,null,0,0,0,0,null,{"$f":"SUM(Tabella1[[#This Row],[Contributi dei Comuni (6900)]:[Contributi di Enti privati (fondaz., associaz., coop., SA, donazioni) (6970)]])-Tabella1[[#This Row],[Finanziamento totale]]","v":0}]
[null,null,null,null,null,null,null,null,{"$f":"IFERROR(VLOOKUP(MID(J50,1,SEARCH(\"-\",J50,1)-2),'Codici COIN'!$C$16:$J$27,8,FALSE),\"\")","v":""},null,null,null,0,0,0,null,0,"",0,{"$f":"IF(R50<>\"Sì\",0,IF(J50='Codici COIN'!$I$17,M50,IF(Q50=0,1,IF(H50>0,M50*Q50/I50,0))))","v":0},0,{"$f":"IF(AND(T50=1,S50=0),0,IF(J50='Codici COIN'!$I$17,M50,M50/2))","v":0},{"$f":"V50*Parametri!$B$13*S50/12","v":0},0,null,null,null,"",null,0,0,0,0,0,0,null,null,null,null,0,0,0,0,null,{"$f":"SUM(Tabella1[[#This Row],[Contributi dei Comuni (6900)]:[Contributi di Enti privati (fondaz., associaz., coop., SA, donazioni) (6970)]])-Tabella1[[#This Row],[Finanziamento totale]]","v":0}]
[null,null,null,null,null,null,null,null,{"$f":"IFERROR(VLOOKUP(MID(J51,1,SEARCH(\"-\",J51,1)-2),'Codici COIN'!$C$16:$J$27,8,FALSE),\"\")","v":""},null,null,null,0,0,0,null,0,"",0,{"$f":"IF(R51<>\"Sì\",0,IF(J51='Codici COIN'!$I$17,M51,IF(Q51=0,1,IF(H51>0,M51*Q51/I51,0))))","v":0},0,{"$f":"IF(AND(T51=1,S51=0),0,IF(J51='Codici COIN'!$I$17,M51,M51/2))","v":0},{"$f":"V51*Parametri!$B$13*S51/12","v":0},0,null,null,null,"",null,0,0,0,0,0,0,null,null,null,null,0,0,0,0,null,{"$f":"SUM(Tabella1[[#This Row],[Contributi dei Comuni (6900)]:[Contributi di Enti privati (fondaz., associaz., coop., SA, donazioni) (6970)]])-Tabella1[[#This Row],[Finanziamento totale]]","v":0}]
[null,null,null,null,null,null,null,null,{"$f":"IFERROR(VLOOKUP(MID(J52,1,SEARCH(\"-\",J52,1)-2),'Codici COIN'!$C$16:$J$27,8,FALSE),\"\")","v":""},null,null,null,0,0,0,null,0,"",0,{"$f":"IF(R52<>\"Sì\",0,IF(J52='Codici COIN'!$I$17,M52,IF(Q52=0,1,IF(H52>0,M52*Q52/I52,0))))","v":0},0,{"$f":"IF(AND(T52=1,S52=0),0,IF(J52='Codici COIN'!$I$17,M52,M52/2))","v":0},{"$f":"V52*Parametri!$B$13*S52/12","v":0},0,null,null,null,"",null,0,0,0,0,0,0,null,null,null,null,0,0,0,0,null,{"$f":"SUM(Tabella1[[#This Row],[Contributi dei Comuni (6900)]:[Contributi di Enti privati (fondaz., associaz., coop., SA, donazioni) (6970)]])-Tabella1[[#This Row],[Finanziamento totale]]","v":0}]
[null,null,null,null,null,null,null,null,{"$f":"IFERROR(VLOOKUP(MID(J53,1,SEARCH(\"-\",J53,1)-2),'Codici COIN'!$C$16:$J$27,8,FALSE),\"\")","v":""},null,null,null,0,0,0,null,0,"",0,{"$f":"IF(R53<>\"Sì\",0,IF(J53='Codici COIN'!$I$17,M53,IF(Q53=0,1,IF(H53>0,M53*Q53/I53,0))))","v":0},0,{"$f":"IF(AND(T53=1,S53=0),0,IF(J53='Codici COIN'!$I$17,M53,M53/2))","v":0},{"$f":"V53*Parametri!$B$13*S53/12","v":0},0,null,null,null,"",null,0,0,0,0,0,0,null,null,null,null,0,0,0,0,null,{"$f":"SUM(Tabella1[[#This Row],[Contributi dei Comuni (6900)]:[Contributi di Enti privati (fondaz., associaz., coop., SA, donazioni) (6970)]])-Tabella1[[#This Row],[Finanziamento totale]]","v":0}]
[null,null,null,null,null,null,null,null,{"$f":"IFERROR(VLOOKUP(MID(J54,1,SEARCH(\"-\",J54,1)-2),'Codici COIN'!$C$16:$J$27,8,FALSE),\"\")","v":""},null,null,null,0,0,0,null,0,"",0,{"$f":"IF(R54<>\"Sì\",0,IF(J54='Codici COIN'!$I$17,M54,IF(Q54=0,1,IF(H54>0,M54*Q54/I54,0))))","v":0},0,{"$f":"IF(AND(T54=1,S54=0),0,IF(J54='Codici COIN'!$I$17,M54,M54/2))","v":0},{"$f":"V54*Parametri!$B$13*S54/12","v":0},0,null,null,null,"",null,0,0,0,0,0,0,null,null,null,null,0,0,0,0,null,{"$f":"SUM(Tabella1[[#This Row],[Contributi dei Comuni (6900)]:[Contributi di Enti privati (fondaz., associaz., coop., SA, donazioni) (6970)]])-Tabella1[[#This Row],[Finanziamento totale]]","v":0}]
[null,null,null,null,null,null,null,null,{"$f":"IFERROR(VLOOKUP(MID(J55,1,SEARCH(\"-\",J55,1)-2),'Codici COIN'!$C$16:$J$27,8,FALSE),\"\")","v":""},null,null,null,0,0,0,null,0,"",0,{"$f":"IF(R55<>\"Sì\",0,IF(J55='Codici COIN'!$I$17,M55,IF(Q55=0,1,IF(H55>0,M55*Q55/I55,0))))","v":0},0,{"$f":"IF(AND(T55=1,S55=0),0,IF(J55='Codici COIN'!$I$17,M55,M55/2))","v":0},{"$f":"V55*Parametri!$B$13*S55/12","v":0},0,null,null,null,"",null,0,0,0,0,0,0,null,null,null,null,0,0,0,0,null,{"$f":"SUM(Tabella1[[#This Row],[Contributi dei Comuni (6900)]:[Contributi di Enti privati (fondaz., associaz., coop., SA, donazioni) (6970)]])-Tabella1[[#This Row],[Finanziamento totale]]","v":0}]
[null,null,null,null,null,null,null,null,{"$f":"IFERROR(VLOOKUP(MID(J56,1,SEARCH(\"-\",J56,1)-2),'Codici COIN'!$C$16:$J$27,8,FALSE),\"\")","v":""},null,null,null,0,0,0,null,0,"",0,{"$f":"IF(R56<>\"Sì\",0,IF(J56='Codici COIN'!$I$17,M56,IF(Q56=0,1,IF(H56>0,M56*Q56/I56,0))))","v":0},0,{"$f":"IF(AND(T56=1,S56=0),0,IF(J56='Codici COIN'!$I$17,M56,M56/2))","v":0},{"$f":"V56*Parametri!$B$13*S56/12","v":0},0,null,null,null,"",null,0,0,0,0,0,0,null,null,null,null,0,0,0,0,null,{"$f":"SUM(Tabella1[[#This Row],[Contributi dei Comuni (6900)]:[Contributi di Enti privati (fondaz., associaz., coop., SA, donazioni) (6970)]])-Tabella1[[#This Row],[Finanziamento totale]]","v":0}]
[null,null,null,null,null,null,null,null,{"$f":"IFERROR(VLOOKUP(MID(J57,1,SEARCH(\"-\",J57,1)-2),'Codici COIN'!$C$16:$J$27,8,FALSE),\"\")","v":""},null,null,null,0,0,0,null,0,"",0,{"$f":"IF(R57<>\"Sì\",0,IF(J57='Codici COIN'!$I$17,M57,IF(Q57=0,1,IF(H57>0,M57*Q57/I57,0))))","v":0},0,{"$f":"IF(AND(T57=1,S57=0),0,IF(J57='Codici COIN'!$I$17,M57,M57/2))","v":0},{"$f":"V57*Parametri!$B$13*S57/12","v":0},0,null,null,null,"",null,0,0,0,0,0,0,null,null,null,null,0,0,0,0,null,{"$f":"SUM(Tabella1[[#This Row],[Contributi dei Comuni (6900)]:[Contributi di Enti privati (fondaz., associaz., coop., SA, donazioni) (6970)]])-Tabella1[[#This Row],[Finanziamento totale]]","v":0}]
[null,null,null,null,null,null,null,null,{"$f":"IFERROR(VLOOKUP(MID(J58,1,SEARCH(\"-\",J58,1)-2),'Codici COIN'!$C$16:$J$27,8,FALSE),\"\")","v":""},null,null,null,0,0,0,null,0,"",0,{"$f":"IF(R58<>\"Sì\",0,IF(J58='Codici COIN'!$I$17,M58,IF(Q58=0,1,IF(H58>0,M58*Q58/I58,0))))","v":0},0,{"$f":"IF(AND(T58=1,S58=0),0,IF(J58='Codici COIN'!$I$17,M58,M58/2))","v":0},{"$f":"V58*Parametri!$B$13*S58/12","v":0},0,null,null,null,"",null,0,0,0,0,0,0,null,null,null,null,0,0,0,0,null,{"$f":"SUM(Tabella1[[#This Row],[Contributi dei Comuni (6900)]:[Contributi di Enti privati (fondaz., associaz., coop., SA, donazioni) (6970)]])-Tabella1[[#This Row],[Finanziamento totale]]","v":0}]
[null,null,null,null,null,null,null,null,{"$f":"IFERROR(VLOOKUP(MID(J59,1,SEARCH(\"-\",J59,1)-2),'Codici COIN'!$C$16:$J$27,8,FALSE),\"\")","v":""},null,null,null,0,0,0,null,0,"",0,{"$f":"IF(R59<>\"Sì\",0,IF(J59='Codici COIN'!$I$17,M59,IF(Q59=0,1,IF(H59>0,M59*Q59/I59,0))))","v":0},0,{"$f":"IF(AND(T59=1,S59=0),0,IF(J59='Codici COIN'!$I$17,M59,M59/2))","v":0},{"$f":"V59*Parametri!$B$13*S59/12","v":0},0,null,null,null,"",null,0,0,0,0,0,0,null,null,null,null,0,0,0,0,null,{"$f":"SUM(Tabella1[[#This Row],[Contributi dei Comuni (6900)]:[Contributi di Enti privati (fondaz., associaz., coop., SA, donazioni) (6970)]])-Tabella1[[#This Row],[Finanziamento totale]]","v":0}]
[null,null,null,null,null,null,null,null,{"$f":"IFERROR(VLOOKUP(MID(J60,1,SEARCH(\"-\",J60,1)-2),'Codici COIN'!$C$16:$J$27,8,FALSE),\"\")","v":""},null,null,null,0,0,0,null,0,"",0,{"$f":"IF(R60<>\"Sì\",0,IF(J60='Codici COIN'!$I$17,M60,IF(Q60=0,1,IF(H60>0,M60*Q60/I60,0))))","v":0},0,{"$f":"IF(AND(T60=1,S60=0),0,IF(J60='Codici COIN'!$I$17,M60,M60/2))","v":0},{"$f":"V60*Parametri!$B$13*S60/12","v":0},0,null,null,null,"",null,0,0,0,0,0,0,null,null,null,null,0,0,0,0,null,{"$f":"SUM(Tabella1[[#This Row],[Contributi dei Comuni (6900)]:[Contributi di Enti privati (fondaz., associaz., coop., SA, donazioni) (6970)]])-Tabella1[[#This Row],[Finanziamento totale]]","v":0}]
[null,null,null,null,null,null,null,null,{"$f":"IFERROR(VLOOKUP(MID(J61,1,SEARCH(\"-\",J61,1)-2),'Codici COIN'!$C$16:$J$27,8,FALSE),\"\")","v":""},null,null,null,0,0,0,null,0,"",0,{"$f":"IF(R61<>\"Sì\",0,IF(J61='Codici COIN'!$I$17,M61,IF(Q61=0,1,IF(H61>0,M61*Q61/I61,0))))","v":0},0,{"$f":"IF(AND(T61=1,S61=0),0,IF(J61='Codici COIN'!$I$17,M61,M61/2))","v":0},{"$f":"V61*Parametri!$B$13*S61/12","v":0},0,null,null,null,"",null,0,0,0,0,0,0,null,null,null,null,0,0,0,0,null,{"$f":"SUM(Tabella1[[#This Row],[Contributi dei Comuni (6900)]:[Contributi di Enti privati (fondaz., associaz., coop., SA, donazioni) (6970)]])-Tabella1[[#This Row],[Finanziamento totale]]","v":0}]
[null,null,null,null,null,null,null,null,{"$f":"IFERROR(VLOOKUP(MID(J62,1,SEARCH(\"-\",J62,1)-2),'Codici COIN'!$C$16:$J$27,8,FALSE),\"\")","v":""},null,null,null,0,0,0,null,0,"",0,{"$f":"IF(R62<>\"Sì\",0,IF(J62='Codici COIN'!$I$17,M62,IF(Q62=0,1,IF(H62>0,M62*Q62/I62,0))))","v":0},0,{"$f":"IF(AND(T62=1,S62=0),0,IF(J62='Codici COIN'!$I$17,M62,M62/2))","v":0},{"$f":"V62*Parametri!$B$13*S62/12","v":0},0,null,null,null,"",null,0,0,0,0,0,0,null,null,null,null,0,0,0,0,null,{"$f":"SUM(Tabella1[[#This Row],[Contributi dei Comuni (6900)]:[Contributi di Enti privati (fondaz., associaz., coop., SA, donazioni) (6970)]])-Tabella1[[#This Row],[Finanziamento totale]]","v":0}]
[null,null,null,null,null,null,null,null,{"$f":"IFERROR(VLOOKUP(MID(J63,1,SEARCH(\"-\",J63,1)-2),'Codici COIN'!$C$16:$J$27,8,FALSE),\"\")","v":""},null,null,null,0,0,0,null,0,"",0,{"$f":"IF(R63<>\"Sì\",0,IF(J63='Codici COIN'!$I$17,M63,IF(Q63=0,1,IF(H63>0,M63*Q63/I63,0))))","v":0},0,{"$f":"IF(AND(T63=1,S63=0),0,IF(J63='Codici COIN'!$I$17,M63,M63/2))","v":0},{"$f":"V63*Parametri!$B$13*S63/12","v":0},0,null,null,null,"",null,0,0,0,0,0,0,null,null,null,null,0,0,0,0,null,{"$f":"SUM(Tabella1[[#This Row],[Contributi dei Comuni (6900)]:[Contributi di Enti privati (fondaz., associaz., coop., SA, donazioni) (6970)]])-Tabella1[[#This Row],[Finanziamento totale]]","v":0}]
[null,null,null,null,null,null,null,null,{"$f":"IFERROR(VLOOKUP(MID(J64,1,SEARCH(\"-\",J64,1)-2),'Codici COIN'!$C$16:$J$27,8,FALSE),\"\")","v":""},null,null,null,0,0,0,null,0,"",0,{"$f":"IF(R64<>\"Sì\",0,IF(J64='Codici COIN'!$I$17,M64,IF(Q64=0,1,IF(H64>0,M64*Q64/I64,0))))","v":0},0,{"$f":"IF(AND(T64=1,S64=0),0,IF(J64='Codici COIN'!$I$17,M64,M64/2))","v":0},{"$f":"V64*Parametri!$B$13*S64/12","v":0},0,null,null,null,"",null,0,0,0,0,0,0,null,null,null,null,0,0,0,0,null,{"$f":"SUM(Tabella1[[#This Row],[Contributi dei Comuni (6900)]:[Contributi di Enti privati (fondaz., associaz., coop., SA, donazioni) (6970)]])-Tabella1[[#This Row],[Finanziamento totale]]","v":0}]
[null,null,null,null,null,null,null,null,{"$f":"IFERROR(VLOOKUP(MID(J65,1,SEARCH(\"-\",J65,1)-2),'Codici COIN'!$C$16:$J$27,8,FALSE),\"\")","v":""},null,null,null,0,0,0,null,0,"",0,{"$f":"IF(R65<>\"Sì\",0,IF(J65='Codici COIN'!$I$17,M65,IF(Q65=0,1,IF(H65>0,M65*Q65/I65,0))))","v":0},0,{"$f":"IF(AND(T65=1,S65=0),0,IF(J65='Codici COIN'!$I$17,M65,M65/2))","v":0},{"$f":"V65*Parametri!$B$13*S65/12","v":0},0,null,null,null,"",null,0,0,0,0,0,0,null,null,null,null,0,0,0,0,null,{"$f":"SUM(Tabella1[[#This Row],[Contributi dei Comuni (6900)]:[Contributi di Enti privati (fondaz., associaz., coop., SA, donazioni) (6970)]])-Tabella1[[#This Row],[Finanziamento totale]]","v":0}]
[null,null,null,null,null,null,null,null,{"$f":"IFERROR(VLOOKUP(MID(J66,1,SEARCH(\"-\",J66,1)-2),'Codici COIN'!$C$16:$J$27,8,FALSE),\"\")","v":""},null,null,null,0,0,0,null,0,"",0,{"$f":"IF(R66<>\"Sì\",0,IF(J66='Codici COIN'!$I$17,M66,IF(Q66=0,1,IF(H66>0,M66*Q66/I66,0))))","v":0},0,{"$f":"IF(AND(T66=1,S66=0),0,IF(J66='Codici COIN'!$I$17,M66,M66/2))","v":0},{"$f":"V66*Parametri!$B$13*S66/12","v":0},0,null,null,null,"",null,0,0,0,0,0,0,null,null,null,null,0,0,0,0,null,{"$f":"SUM(Tabella1[[#This Row],[Contributi dei Comuni (6900)]:[Contributi di Enti privati (fondaz., associaz., coop., SA, donazioni) (6970)]])-Tabella1[[#This Row],[Finanziamento totale]]","v":0}]
[null,null,null,null,null,null,null,null,{"$f":"IFERROR(VLOOKUP(MID(J67,1,SEARCH(\"-\",J67,1)-2),'Codici COIN'!$C$16:$J$27,8,FALSE),\"\")","v":""},null,null,null,0,0,0,null,0,"",0,{"$f":"IF(R67<>\"Sì\",0,IF(J67='Codici COIN'!$I$17,M67,IF(Q67=0,1,IF(H67>0,M67*Q67/I67,0))))","v":0},0,{"$f":"IF(AND(T67=1,S67=0),0,IF(J67='Codici COIN'!$I$17,M67,M67/2))","v":0},{"$f":"V67*Parametri!$B$13*S67/12","v":0},0,null,null,null,"",null,0,0,0,0,0,0,null,null,null,null,0,0,0,0,null,{"$f":"SUM(Tabella1[[#This Row],[Contributi dei Comuni (6900)]:[Contributi di Enti privati (fondaz., associaz., coop., SA, donazioni) (6970)]])-Tabella1[[#This Row],[Finanziamento totale]]","v":0}]
[null,null,null,null,null,null,null,null,{"$f":"IFERROR(VLOOKUP(MID(J68,1,SEARCH(\"-\",J68,1)-2),'Codici COIN'!$C$16:$J$27,8,FALSE),\"\")","v":""},null,null,null,0,0,0,null,0,"",0,{"$f":"IF(R68<>\"Sì\",0,IF(J68='Codici COIN'!$I$17,M68,IF(Q68=0,1,IF(H68>0,M68*Q68/I68,0))))","v":0},0,{"$f":"IF(AND(T68=1,S68=0),0,IF(J68='Codici COIN'!$I$17,M68,M68/2))","v":0},{"$f":"V68*Parametri!$B$13*S68/12","v":0},0,null,null,null,"",null,0,0,0,0,0,0,null,null,null,null,0,0,0,0,null,{"$f":"SUM(Tabella1[[#This Row],[Contributi dei Comuni (6900)]:[Contributi di Enti privati (fondaz., associaz., coop., SA, donazioni) (6970)]])-Tabella1[[#This Row],[Finanziamento totale]]","v":0}]
[null,null,null,null,null,null,null,null,{"$f":"IFERROR(VLOOKUP(MID(J69,1,SEARCH(\"-\",J69,1)-2),'Codici COIN'!$C$16:$J$27,8,FALSE),\"\")","v":""},null,null,null,0,0,0,null,0,"",0,{"$f":"IF(R69<>\"Sì\",0,IF(J69='Codici COIN'!$I$17,M69,IF(Q69=0,1,IF(H69>0,M69*Q69/I69,0))))","v":0},0,{"$f":"IF(AND(T69=1,S69=0),0,IF(J69='Codici COIN'!$I$17,M69,M69/2))","v":0},{"$f":"V69*Parametri!$B$13*S69/12","v":0},0,null,null,null,"",null,0,0,0,0,0,0,null,null,null,null,0,0,0,0,null,{"$f":"SUM(Tabella1[[#This Row],[Contributi dei Comuni (6900)]:[Contributi di Enti privati (fondaz., associaz., coop., SA, donazioni) (6970)]])-Tabella1[[#This Row],[Finanziamento totale]]","v":0}]
[null,null,null,null,null,null,null,null,{"$f":"IFERROR(VLOOKUP(MID(J70,1,SEARCH(\"-\",J70,1)-2),'Codici COIN'!$C$16:$J$27,8,FALSE),\"\")","v":""},null,null,null,0,0,{"$f":"N70*Z70","v":0},null,0,{"$f":"IF(H70<=0,\"\",IF(AA70>0,\"No, dismesso\",\"Sì\"))","v":""},0,{"$f":"IF(R70<>\"Sì\",0,IF(J70='Codici COIN'!$I$17,M70,IF(Q70=0,1,IF(H70>0,M70*Q70/I70,0))))","v":0},{"$f":"+T70*Z70","v":0},{"$f":"IF(AND(T70=1,S70=0),0,IF(J70='Codici COIN'!$I$17,M70,M70/2))","v":0},{"$f":"V70*Parametri!$B$13*S70/12","v":0},{"$f":"IF(V70>0,W70*Z70,0)","v":0},null,null,null,{"$f":"IF(AA70>0,IF(I70=\"n/a\",M70,MAX(0,(I70-(DATEDIF(H70,AA70,\"M\")+1)/12)*M70/I70)),\"\")","v":""},null,{"$f":"N70+W70","v":0},{"$f":"IF($M70>0,($AD70/$M70)*(AJ70+80%*$AM70),0)","v":0},{"$f":"IF($M70>0,($AD70/$M70)*(AK70+20%*$AM70),0)","v":0},{"$f":"IF($M70>0,($AD70/$M70)*(AL70),0)","v":0},{"$f":"IF($M70>0,($AD70/$M70)*AN70,0)","v":0},{"$f":"M70","v":0},null,null,null,null,0,{"$f":"IF(M70>0,$N70/$M70*AJ70,0)","v":0},{"$f":"IF(M70>0,$N70/$M70*AK70,0)","v":0},{"$f":"IF(M70>0,$N70/$M70*AL70,0)","v":0},null,{"$f":"SUM(Tabella1[[#This Row],[Contributi dei Comuni (6900)]:[Contributi di Enti privati (fondaz., associaz., coop., SA, donazioni) (6970)]])-Tabella1[[#This Row],[Finanziamento totale]]","v":0}]
[null,null,null,null,null,null,null,null,{"$f":"IFERROR(VLOOKUP(MID(J71,1,SEARCH(\"-\",J71,1)-2),'Codici COIN'!$C$16:$J$27,8,FALSE),\"\")","v":""},null,null,null,{"$f":"B71*K71+L71","v":0},{"$f":"IF(OR(I71=\"n/a\",M71=1,H71<=0),0,M71/I71*S71/12)","v":0},0,null,{"$f":"IF(OR(I71=\"n/a\",H71=0),0,MAX(I71-(DATEDIF(H71,$G$2,\"M\")+1)/12,0))","v":0},"",{"$f":"IF(H71=0,0,IF(R71=\"Sì\",IF(YEAR(H71)=YEAR($G$2),12-MONTH(H71)+1,IF(YEAR(H71)+IF(I71=\"n/a\",999,I71)=YEAR($G$2),MONTH(H71)-1,IF(YEAR(H71)+IF(I71=\"n/a\",999,I71)<YEAR($G$2),0,12))),IF(AND(AA71>0,YEAR(AA71)<YEAR($G$2)),0,MAX(0,MIN(MONTH(AA71),IF(I71=\"n/a\",999,I71)*12-DATEDIF(H71,DATE(YEAR($G$2),1,1),\"M\"))))))","v":0},{"$f":"IF(R71<>\"Sì\",0,IF(J71='Codici COIN'!$I$17,M71,IF(Q71=0,1,IF(H71>0,M71*Q71/I71,0))))","v":0},0,{"$f":"IF(AND(T71=1,S71=0),0,IF(J71='Codici COIN'!$I$17,M71,M71/2))","v":0},{"$f":"V71*Parametri!$B$13*S71/12","v":0},0,null,null,null,"",null,0,0,0,0,0,0,null,null,null,null,{"$f":"AI71-AJ71-AK71-AL71-AM71","v":0},0,0,0,null,{"$f":"SUM(Tabella1[[#This Row],[Contributi dei Comuni (6900)]:[Contributi di Enti privati (fondaz., associaz., coop., SA, donazioni) (6970)]])-Tabella1[[#This Row],[Finanziamento totale]]","v":0}]
[null,null,null,null,null,null,null,null,{"$f":"IFERROR(VLOOKUP(MID(J72,1,SEARCH(\"-\",J72,1)-2),'Codici COIN'!$C$16:$J$27,8,FALSE),\"\")","v":""},null,null,null,0,0,0,null,0,"",0,{"$f":"IF(R72<>\"Sì\",0,IF(J72='Codici COIN'!$I$17,M72,IF(Q72=0,1,IF(H72>0,M72*Q72/I72,0))))","v":0},0,{"$f":"IF(AND(T72=1,S72=0),0,IF(J72='Codici COIN'!$I$17,M72,M72/2))","v":0},{"$f":"V72*Parametri!$B$13*S72/12","v":0},0,null,null,null,"",null,0,0,0,0,0,0,null,null,null,null,0,0,0,0,null,{"$f":"SUM(Tabella1[[#This Row],[Contributi dei Comuni (6900)]:[Contributi di Enti privati (fondaz., associaz., coop., SA, donazioni) (6970)]])-Tabella1[[#This Row],[Finanziamento totale]]","v":0}]
[null,null,null,null,null,null,null,null,{"$f":"IFERROR(VLOOKUP(MID(J73,1,SEARCH(\"-\",J73,1)-2),'Codici COIN'!$C$16:$J$27,8,FALSE),\"\")","v":""},null,null,null,0,0,0,null,0,"",0,{"$f":"IF(R73<>\"Sì\",0,IF(J73='Codici COIN'!$I$17,M73,IF(Q73=0,1,IF(H73>0,M73*Q73/I73,0))))","v":0},0,{"$f":"IF(AND(T73=1,S73=0),0,IF(J73='Codici COIN'!$I$17,M73,M73/2))","v":0},{"$f":"V73*Parametri!$B$13*S73/12","v":0},0,null,null,null,"",null,0,0,0,0,0,0,null,null,null,null,0,0,0,0,null,{"$f":"SUM(Tabella1[[#This Row],[Contributi dei Comuni (6900)]:[Contributi di Enti privati (fondaz., associaz., coop., SA, donazioni) (6970)]])-Tabella1[[#This Row],[Finanziamento totale]]","v":0}]
[null,null,null,null,null,null,null,null,{"$f":"IFERROR(VLOOKUP(MID(J74,1,SEARCH(\"-\",J74,1)-2),'Codici COIN'!$C$16:$J$27,8,FALSE),\"\")","v":""},null,null,null,0,0,0,null,0,"",0,{"$f":"IF(R74<>\"Sì\",0,IF(J74='Codici COIN'!$I$17,M74,IF(Q74=0,1,IF(H74>0,M74*Q74/I74,0))))","v":0},0,{"$f":"IF(AND(T74=1,S74=0),0,IF(J74='Codici COIN'!$I$17,M74,M74/2))","v":0},{"$f":"V74*Parametri!$B$13*S74/12","v":0},0,null,null,null,"",null,0,0,0,0,0,0,null,null,null,null,0,0,0,0,null,{"$f":"SUM(Tabella1[[#This Row],[Contributi dei Comuni (6900)]:[Contributi di Enti privati (fondaz., associaz., coop., SA, donazioni) (6970)]])-Tabella1[[#This Row],[Finanziamento totale]]","v":0}]
[null,null,null,null,null,null,null,null,{"$f":"IFERROR(VLOOKUP(MID(J75,1,SEARCH(\"-\",J75,1)-2),'Codici COIN'!$C$16:$J$27,8,FALSE),\"\")","v":""},null,null,null,0,0,0,null,0,"",0,{"$f":"IF(R75<>\"Sì\",0,IF(J75='Codici COIN'!$I$17,M75,IF(Q75=0,1,IF(H75>0,M75*Q75/I75,0))))","v":0},0,{"$f":"IF(AND(T75=1,S75=0),0,IF(J75='Codici COIN'!$I$17,M75,M75/2))","v":0},{"$f":"V75*Parametri!$B$13*S75/12","v":0},0,null,null,null,"",null,0,0,0,0,0,0,null,null,null,null,0,0,0,0,null,{"$f":"SUM(Tabella1[[#This Row],[Contributi dei Comuni (6900)]:[Contributi di Enti privati (fondaz., associaz., coop., SA, donazioni) (6970)]])-Tabella1[[#This Row],[Finanziamento totale]]","v":0}]
[null,null,null,null,null,null,null,null,{"$f":"IFERROR(VLOOKUP(MID(J76,1,SEARCH(\"-\",J76,1)-2),'Codici COIN'!$C$16:$J$27,8,FALSE),\"\")","v":""},null,null,null,0,0,0,null,0,"",0,{"$f":"IF(R76<>\"Sì\",0,IF(J76='Codici COIN'!$I$17,M76,IF(Q76=0,1,IF(H76>0,M76*Q76/I76,0))))","v":0},0,{"$f":"IF(AND(T76=1,S76=0),0,IF(J76='Codici COIN'!$I$17,M76,M76/2))","v":0},{"$f":"V76*Parametri!$B$13*S76/12","v":0},0,null,null,null,"",null,0,0,0,0,0,0,null,null,null,null,0,0,0,0,null,{"$f":"SUM(Tabella1[[#This Row],[Contributi dei Comuni (6900)]:[Contributi di Enti privati (fondaz., associaz., coop., SA, donazioni) (6970)]])-Tabella1[[#This Row],[Finanziamento totale]]","v":0}]
[null,null,null,null,null,null,null,null,{"$f":"IFERROR(VLOOKUP(MID(J77,1,SEARCH(\"-\",J77,1)-2),'Codici COIN'!$C$16:$J$27,8,FALSE),\"\")","v":""},null,null,null,0,0,0,null,0,"",0,{"$f":"IF(R77<>\"Sì\",0,IF(J77='Codici COIN'!$I$17,M77,IF(Q77=0,1,IF(H77>0,M77*Q77/I77,0))))","v":0},0,{"$f":"IF(AND(T77=1,S77=0),0,IF(J77='Codici COIN'!$I$17,M77,M77/2))","v":0},{"$f":"V77*Parametri!$B$13*S77/12","v":0},0,null,null,null,"",null,0,0,0,0,0,0,null,null,null,null,0,0,0,0,null,{"$f":"SUM(Tabella1[[#This Row],[Contributi dei Comuni (6900)]:[Contributi di Enti privati (fondaz., associaz., coop., SA, donazioni) (6970)]])-Tabella1[[#This Row],[Finanziamento totale]]","v":0}]
[null,null,null,null,null,null,null,null,{"$f":"IFERROR(VLOOKUP(MID(J78,1,SEARCH(\"-\",J78,1)-2),'Codici COIN'!$C$16:$J$27,8,FALSE),\"\")","v":""},null,null,null,0,0,0,null,0,"",0,{"$f":"IF(R78<>\"Sì\",0,IF(J78='Codici COIN'!$I$17,M78,IF(Q78=0,1,IF(H78>0,M78*Q78/I78,0))))","v":0},0,{"$f":"IF(AND(T78=1,S78=0),0,IF(J78='Codici COIN'!$I$17,M78,M78/2))","v":0},{"$f":"V78*Parametri!$B$13*S78/12","v":0},0,null,null,null,"",null,0,0,0,0,0,0,null,null,null,null,0,0,0,0,null,{"$f":"SUM(Tabella1[[#This Row],[Contributi dei Comuni (6900)]:[Contributi di Enti privati (fondaz., associaz., coop., SA, donazioni) (6970)]])-Tabella1[[#This Row],[Finanziamento totale]]","v":0}]
[null,null,null,null,null,null,null,null,{"$f":"IFERROR(VLOOKUP(MID(J79,1,SEARCH(\"-\",J79,1)-2),'Codici COIN'!$C$16:$J$27,8,FALSE),\"\")","v":""},null,null,null,0,0,0,null,0,"",0,{"$f":"IF(R79<>\"Sì\",0,IF(J79='Codici COIN'!$I$17,M79,IF(Q79=0,1,IF(H79>0,M79*Q79/I79,0))))","v":0},0,{"$f":"IF(AND(T79=1,S79=0),0,IF(J79='Codici COIN'!$I$17,M79,M79/2))","v":0},{"$f":"V79*Parametri!$B$13*S79/12","v":0},0,null,null,null,"",null,0,0,0,0,0,0,null,null,null,null,0,0,0,0,null,{"$f":"SUM(Tabella1[[#This Row],[Contributi dei Comuni (6900)]:[Contributi di Enti privati (fondaz., associaz., coop., SA, donazioni) (6970)]])-Tabella1[[#This Row],[Finanziamento totale]]","v":0}]
[null,null,null,null,null,null,null,null,{"$f":"IFERROR(VLOOKUP(MID(J80,1,SEARCH(\"-\",J80,1)-2),'Codici COIN'!$C$16:$J$27,8,FALSE),\"\")","v":""},null,null,null,0,0,0,null,0,"",0,{"$f":"IF(R80<>\"Sì\",0,IF(J80='Codici COIN'!$I$17,M80,IF(Q80=0,1,IF(H80>0,M80*Q80/I80,0))))","v":0},0,{"$f":"IF(AND(T80=1,S80=0),0,IF(J80='Codici COIN'!$I$17,M80,M80/2))","v":0},{"$f":"V80*Parametri!$B$13*S80/12","v":0},0,null,null,null,"",null,0,0,0,0,0,0,null,null,null,null,0,0,0,0,null,{"$f":"SUM(Tabella1[[#This Row],[Contributi dei Comuni (6900)]:[Contributi di Enti privati (fondaz., associaz., coop., SA, donazioni) (6970)]])-Tabella1[[#This Row],[Finanziamento totale]]","v":0}]
[null,null,null,null,null,null,null,null,{"$f":"IFERROR(VLOOKUP(MID(J81,1,SEARCH(\"-\",J81,1)-2),'Codici COIN'!$C$16:$J$27,8,FALSE),\"\")","v":""},null,null,null,0,0,0,null,0,"",0,{"$f":"IF(R81<>\"Sì\",0,IF(J81='Codici COIN'!$I$17,M81,IF(Q81=0,1,IF(H81>0,M81*Q81/I81,0))))","v":0},0,{"$f":"IF(AND(T81=1,S81=0),0,IF(J81='Codici COIN'!$I$17,M81,M81/2))","v":0},{"$f":"V81*Parametri!$B$13*S81/12","v":0},0,null,null,null,"",null,0,0,0,0,0,0,null,null,null,null,0,0,0,0,null,{"$f":"SUM(Tabella1[[#This Row],[Contributi dei Comuni (6900)]:[Contributi di Enti privati (fondaz., associaz., coop., SA, donazioni) (6970)]])-Tabella1[[#This Row],[Finanziamento totale]]","v":0}]
[null,null,null,null,null,null,null,null,{"$f":"IFERROR(VLOOKUP(MID(J82,1,SEARCH(\"-\",J82,1)-2),'Codici COIN'!$C$16:$J$27,8,FALSE),\"\")","v":""},null,null,null,0,0,0,null,0,"",0,{"$f":"IF(R82<>\"Sì\",0,IF(J82='Codici COIN'!$I$17,M82,IF(Q82=0,1,IF(H82>0,M82*Q82/I82,0))))","v":0},0,{"$f":"IF(AND(T82=1,S82=0),0,IF(J82='Codici COIN'!$I$17,M82,M82/2))","v":0},{"$f":"V82*Parametri!$B$13*S82/12","v":0},0,null,null,null,"",null,0,0,0,0,0,0,null,null,null,null,0,0,0,0,null,{"$f":"SUM(Tabella1[[#This Row],[Contributi dei Comuni (6900)]:[Contributi di Enti privati (fondaz., associaz., coop., SA, donazioni) (6970)]])-Tabella1[[#This Row],[Finanziamento totale]]","v":0}]
[null,null,null,null,null,null,null,null,{"$f":"IFERROR(VLOOKUP(MID(J83,1,SEARCH(\"-\",J83,1)-2),'Codici COIN'!$C$16:$J$27,8,FALSE),\"\")","v":""},null,null,null,0,0,0,null,0,"",0,{"$f":"IF(R83<>\"Sì\",0,IF(J83='Codici COIN'!$I$17,M83,IF(Q83=0,1,IF(H83>0,M83*Q83/I83,0))))","v":0},0,{"$f":"IF(AND(T83=1,S83=0),0,IF(J83='Codici COIN'!$I$17,M83,M83/2))","v":0},{"$f":"V83*Parametri!$B$13*S83/12","v":0},0,null,null,null,"",null,0,0,0,0,0,0,null,null,null,null,0,0,0,0,null,{"$f":"SUM(Tabella1[[#This Row],[Contributi dei Comuni (6900)]:[Contributi di Enti privati (fondaz., associaz., coop., SA, donazioni) (6970)]])-Tabella1[[#This Row],[Finanziamento totale]]","v":0}]
[null,null,null,null,null,null,null,null,{"$f":"IFERROR(VLOOKUP(MID(J84,1,SEARCH(\"-\",J84,1)-2),'Codici COIN'!$C$16:$J$27,8,FALSE),\"\")","v":""},null,null,null,0,0,0,null,0,"",0,{"$f":"IF(R84<>\"Sì\",0,IF(J84='Codici COIN'!$I$17,M84,IF(Q84=0,1,IF(H84>0,M84*Q84/I84,0))))","v":0},0,{"$f":"IF(AND(T84=1,S84=0),0,IF(J84='Codici COIN'!$I$17,M84,M84/2))","v":0},{"$f":"V84*Parametri!$B$13*S84/12","v":0},0,null,null,null,"",null,0,0,0,0,0,0,null,null,null,null,0,0,0,0,null,{"$f":"SUM(Tabella1[[#This Row],[Contributi dei Comuni (6900)]:[Contributi di Enti privati (fondaz., associaz., coop., SA, donazioni) (6970)]])-Tabella1[[#This Row],[Finanziamento totale]]","v":0}]
[null,null,null,null,null,null,null,null,{"$f":"IFERROR(VLOOKUP(MID(J85,1,SEARCH(\"-\",J85,1)-2),'Codici COIN'!$C$16:$J$27,8,FALSE),\"\")","v":""},null,null,null,0,0,0,null,0,"",0,{"$f":"IF(R85<>\"Sì\",0,IF(J85='Codici COIN'!$I$17,M85,IF(Q85=0,1,IF(H85>0,M85*Q85/I85,0))))","v":0},0,{"$f":"IF(AND(T85=1,S85=0),0,IF(J85='Codici COIN'!$I$17,M85,M85/2))","v":0},{"$f":"V85*Parametri!$B$13*S85/12","v":0},0,null,null,null,"",null,0,0,0,0,0,0,null,null,null,null,0,0,0,0,null,{"$f":"SUM(Tabella1[[#This Row],[Contributi dei Comuni (6900)]:[Contributi di Enti privati (fondaz., associaz., coop., SA, donazioni) (6970)]])-Tabella1[[#This Row],[Finanziamento totale]]","v":0}]
[null,null,null,null,null,null,null,null,{"$f":"IFERROR(VLOOKUP(MID(J86,1,SEARCH(\"-\",J86,1)-2),'Codici COIN'!$C$16:$J$27,8,FALSE),\"\")","v":""},null,null,null,0,0,0,null,0,"",0,{"$f":"IF(R86<>\"Sì\",0,IF(J86='Codici COIN'!$I$17,M86,IF(Q86=0,1,IF(H86>0,M86*Q86/I86,0))))","v":0},0,{"$f":"IF(AND(T86=1,S86=0),0,IF(J86='Codici COIN'!$I$17,M86,M86/2))","v":0},{"$f":"V86*Parametri!$B$13*S86/12","v":0},0,null,null,null,"",null,0,0,0,0,0,0,null,null,null,null,0,0,0,0,null,{"$f":"SUM(Tabella1[[#This Row],[Contributi dei Comuni (6900)]:[Contributi di Enti privati (fondaz., associaz., coop., SA, donazioni) (6970)]])-Tabella1[[#This Row],[Finanziamento totale]]","v":0}]
[null,null,null,null,null,null,null,null,{"$f":"IFERROR(VLOOKUP(MID(J87,1,SEARCH(\"-\",J87,1)-2),'Codici COIN'!$C$16:$J$27,8,FALSE),\"\")","v":""},null,null,null,0,0,0,null,0,"",0,{"$f":"IF(R87<>\"Sì\",0,IF(J87='Codici COIN'!$I$17,M87,IF(Q87=0,1,IF(H87>0,M87*Q87/I87,0))))","v":0},0,{"$f":"IF(AND(T87=1,S87=0),0,IF(J87='Codici COIN'!$I$17,M87,M87/2))","v":0},{"$f":"V87*Parametri!$B$13*S87/12","v":0},0,null,null,null,"",null,0,0,0,0,0,0,null,null,null,null,0,0,0,0,null,{"$f":"SUM(Tabella1[[#This Row],[Contributi dei Comuni (6900)]:[Contributi di Enti privati (fondaz., associaz., coop., SA, donazioni) (6970)]])-Tabella1[[#This Row],[Finanziamento totale]]","v":0}]
[null,null,null,null,null,null,null,null,{"$f":"IFERROR(VLOOKUP(MID(J88,1,SEARCH(\"-\",J88,1)-2),'Codici COIN'!$C$16:$J$27,8,FALSE),\"\")","v":""},null,null,null,0,0,0,null,0,"",0,{"$f":"IF(R88<>\"Sì\",0,IF(J88='Codici COIN'!$I$17,M88,IF(Q88=0,1,IF(H88>0,M88*Q88/I88,0))))","v":0},0,{"$f":"IF(AND(T88=1,S88=0),0,IF(J88='Codici COIN'!$I$17,M88,M88/2))","v":0},{"$f":"V88*Parametri!$B$13*S88/12","v":0},0,null,null,null,"",null,0,0,0,0,0,0,null,null,null,null,0,0,0,0,null,{"$f":"SUM(Tabella1[[#This Row],[Contributi dei Comuni (6900)]:[Contributi di Enti privati (fondaz., associaz., coop., SA, donazioni) (6970)]])-Tabella1[[#This Row],[Finanziamento totale]]","v":0}]
[null,null,null,null,null,null,null,null,{"$f":"IFERROR(VLOOKUP(MID(J89,1,SEARCH(\"-\",J89,1)-2),'Codici COIN'!$C$16:$J$27,8,FALSE),\"\")","v":""},null,null,null,0,0,0,null,0,"",0,{"$f":"IF(R89<>\"Sì\",0,IF(J89='Codici COIN'!$I$17,M89,IF(Q89=0,1,IF(H89>0,M89*Q89/I89,0))))","v":0},0,{"$f":"IF(AND(T89=1,S89=0),0,IF(J89='Codici COIN'!$I$17,M89,M89/2))","v":0},{"$f":"V89*Parametri!$B$13*S89/12","v":0},0,null,null,null,"",null,0,0,0,0,0,0,null,null,null,null,0,0,0,0,null,{"$f":"SUM(Tabella1[[#This Row],[Contributi dei Comuni (6900)]:[Contributi di Enti privati (fondaz., associaz., coop., SA, donazioni) (6970)]])-Tabella1[[#This Row],[Finanziamento totale]]","v":0}]
[null,null,null,null,null,null,null,null,{"$f":"IFERROR(VLOOKUP(MID(J90,1,SEARCH(\"-\",J90,1)-2),'Codici COIN'!$C$16:$J$27,8,FALSE),\"\")","v":""},null,null,null,0,0,0,null,0,"",0,{"$f":"IF(R90<>\"Sì\",0,IF(J90='Codici COIN'!$I$17,M90,IF(Q90=0,1,IF(H90>0,M90*Q90/I90,0))))","v":0},0,{"$f":"IF(AND(T90=1,S90=0),0,IF(J90='Codici COIN'!$I$17,M90,M90/2))","v":0},{"$f":"V90*Parametri!$B$13*S90/12","v":0},0,null,null,null,"",null,0,0,0,0,0,0,null,null,null,null,0,0,0,0,null,{"$f":"SUM(Tabella1[[#This Row],[Contributi dei Comuni (6900)]:[Contributi di Enti privati (fondaz., associaz., coop., SA, donazioni) (6970)]])-Tabella1[[#This Row],[Finanziamento totale]]","v":0}]
[null,null,null,null,null,null,null,null,{"$f":"IFERROR(VLOOKUP(MID(J91,1,SEARCH(\"-\",J91,1)-2),'Codici COIN'!$C$16:$J$27,8,FALSE),\"\")","v":""},null,null,null,0,0,0,null,0,"",0,{"$f":"IF(R91<>\"Sì\",0,IF(J91='Codici COIN'!$I$17,M91,IF(Q91=0,1,IF(H91>0,M91*Q91/I91,0))))","v":0},0,{"$f":"IF(AND(T91=1,S91=0),0,IF(J91='Codici COIN'!$I$17,M91,M91/2))","v":0},{"$f":"V91*Parametri!$B$13*S91/12","v":0},0,null,null,null,"",null,0,0,0,0,0,0,null,null,null,null,0,0,0,0,null,{"$f":"SUM(Tabella1[[#This Row],[Contributi dei Comuni (6900)]:[Contributi di Enti privati (fondaz., associaz., coop., SA, donazioni) (6970)]])-Tabella1[[#This Row],[Finanziamento totale]]","v":0}]
[null,null,null,null,null,null,null,null,{"$f":"IFERROR(VLOOKUP(MID(J92,1,SEARCH(\"-\",J92,1)-2),'Codici COIN'!$C$16:$J$27,8,FALSE),\"\")","v":""},null,null,null,0,0,0,null,0,"",0,{"$f":"IF(R92<>\"Sì\",0,IF(J92='Codici COIN'!$I$17,M92,IF(Q92=0,1,IF(H92>0,M92*Q92/I92,0))))","v":0},0,{"$f":"IF(AND(T92=1,S92=0),0,IF(J92='Codici COIN'!$I$17,M92,M92/2))","v":0},{"$f":"V92*Parametri!$B$13*S92/12","v":0},0,null,null,null,"",null,0,0,0,0,0,0,null,null,null,null,0,0,0,0,null,{"$f":"SUM(Tabella1[[#This Row],[Contributi dei Comuni (6900)]:[Contributi di Enti privati (fondaz., associaz., coop., SA, donazioni) (6970)]])-Tabella1[[#This Row],[Finanziamento totale]]","v":0}]
[null,null,null,null,null,null,null,null,{"$f":"IFERROR(VLOOKUP(MID(J93,1,SEARCH(\"-\",J93,1)-2),'Codici COIN'!$C$16:$J$27,8,FALSE),\"\")","v":""},null,null,null,0,0,0,null,0,"",0,{"$f":"IF(R93<>\"Sì\",0,IF(J93='Codici COIN'!$I$17,M93,IF(Q93=0,1,IF(H93>0,M93*Q93/I93,0))))","v":0},0,{"$f":"IF(AND(T93=1,S93=0),0,IF(J93='Codici COIN'!$I$17,M93,M93/2))","v":0},{"$f":"V93*Parametri!$B$13*S93/12","v":0},0,null,null,null,"",null,0,0,0,0,0,0,null,null,null,null,0,0,0,0,null,{"$f":"SUM(Tabella1[[#This Row],[Contributi dei Comuni (6900)]:[Contributi di Enti privati (fondaz., associaz., coop., SA, donazioni) (6970)]])-Tabella1[[#This Row],[Finanziamento totale]]","v":0}]
[null,null,null,null,null,null,null,null,{"$f":"IFERROR(VLOOKUP(MID(J94,1,SEARCH(\"-\",J94,1)-2),'Codici COIN'!$C$16:$J$27,8,FALSE),\"\")","v":""},null,null,null,{"$f":"B94*K94+L94","v":0},{"$f":"IF(OR(I94=\"n/a\",M94=1,H94<=0),0,M94/I94*S94/12)","v":0},{"$f":"N94*Z94","v":0},null,0,{"$f":"IF(H94<=0,\"\",IF(AA94>0,\"No, dismesso\",\"Sì\"))","v":""},0,{"$f":"IF(R94<>\"Sì\",0,IF(J94='Codici COIN'!$I$17,M94,IF(Q94=0,1,IF(H94>0,M94*Q94/I94,0))))","v":0},{"$f":"+T94*Z94","v":0},{"$f":"IF(AND(T94=1,S94=0),0,IF(J94='Codici COIN'!$I$17,M94,M94/2))","v":0},{"$f":"V94*Parametri!$B$13*S94/12","v":0},{"$f":"IF(V94>0,W94*Z94,0)","v":0},null,null,null,{"$f":"IF(AA94>0,IF(I94=\"n/a\",M94,MAX(0,(I94-(DATEDIF(H94,AA94,\"M\")+1)/12)*M94/I94)),\"\")","v":""},null,{"$f":"N94+W94","v":0},{"$f":"IF($M94>0,($AD94/$M94)*(AJ94+80%*$AM94),0)","v":0},{"$f":"IF($M94>0,($AD94/$M94)*(AK94+20%*$AM94),0)","v":0},{"$f":"IF($M94>0,($AD94/$M94)*(AL94),0)","v":0},{"$f":"IF($M94>0,($AD94/$M94)*AN94,0)","v":0},{"$f":"M94","v":0},null,null,null,null,{"$f":"AI94-AJ94-AK94-AL94-AM94","v":0},{"$f":"IF(M94>0,$N94/$M94*AJ94,0)","v":0},{"$f":"IF(M94>0,$N94/$M94*AK94,0)","v":0},{"$f":"IF(M94>0,$N94/$M94*AL94,0)","v":0},null,{"$f":"SUM(Tabella1[[#This Row],[Contributi dei Comuni (6900)]:[Contributi di Enti privati (fondaz., associaz., coop., SA, donazioni) (6970)]])-Tabella1[[#This Row],[Finanziamento totale]]","v":0}]
[null,null,null,null,null,null,null,null,{"$f":"IFERROR(VLOOKUP(MID(J95,1,SEARCH(\"-\",J95,1)-2),'Codici COIN'!$C$16:$J$27,8,FALSE),\"\")","v":""},null,null,null,0,0,0,null,0,"",0,{"$f":"IF(R95<>\"Sì\",0,IF(J95='Codici COIN'!$I$17,M95,IF(Q95=0,1,IF(H95>0,M95*Q95/I95,0))))","v":0},0,{"$f":"IF(AND(T95=1,S95=0),0,IF(J95='Codici COIN'!$I$17,M95,M95/2))","v":0},{"$f":"V95*Parametri!$B$13*S95/12","v":0},0,null,null,null,"",null,0,0,0,0,0,0,null,null,null,null,0,0,0,0,null,{"$f":"SUM(Tabella1[[#This Row],[Contributi dei Comuni (6900)]:[Contributi di Enti privati (fondaz., associaz., coop., SA, donazioni) (6970)]])-Tabella1[[#This Row],[Finanziamento totale]]","v":0}]
[null,null,null,null,null,null,null,null,{"$f":"IFERROR(VLOOKUP(MID(J96,1,SEARCH(\"-\",J96,1)-2),'Codici COIN'!$C$16:$J$27,8,FALSE),\"\")","v":""},null,null,null,0,0,0,null,0,"",0,{"$f":"IF(R96<>\"Sì\",0,IF(J96='Codici COIN'!$I$17,M96,IF(Q96=0,1,IF(H96>0,M96*Q96/I96,0))))","v":0},0,{"$f":"IF(AND(T96=1,S96=0),0,IF(J96='Codici COIN'!$I$17,M96,M96/2))","v":0},{"$f":"V96*Parametri!$B$13*S96/12","v":0},0,null,null,null,"",null,0,0,0,0,0,0,null,null,null,null,0,0,0,0,null,{"$f":"SUM(Tabella1[[#This Row],[Contributi dei Comuni (6900)]:[Contributi di Enti privati (fondaz., associaz., coop., SA, donazioni) (6970)]])-Tabella1[[#This Row],[Finanziamento totale]]","v":0}]
[null,null,null,null,null,null,null,null,{"$f":"IFERROR(VLOOKUP(MID(J97,1,SEARCH(\"-\",J97,1)-2),'Codici COIN'!$C$16:$J$27,8,FALSE),\"\")","v":""},null,null,null,{"$f":"B97*K97+L97","v":0},{"$f":"IF(OR(I97=\"n/a\",M97=1,H97<=0),0,M97/I97*S97/12)","v":0},{"$f":"N97*Z97","v":0},null,0,{"$f":"IF(H97<=0,\"\",IF(AA97>0,\"No, dismesso\",\"Sì\"))","v":""},0,{"$f":"IF(R97<>\"Sì\",0,IF(J97='Codici COIN'!$I$17,M97,IF(Q97=0,1,IF(H97>0,M97*Q97/I97,0))))","v":0},{"$f":"+T97*Z97","v":0},{"$f":"IF(AND(T97=1,S97=0),0,IF(J97='Codici COIN'!$I$17,M97,M97/2))","v":0},{"$f":"V97*Parametri!$B$13*S97/12","v":0},{"$f":"IF(V97>0,W97*Z97,0)","v":0},null,null,null,{"$f":"IF(AA97>0,IF(I97=\"n/a\",M97,MAX(0,(I97-(DATEDIF(H97,AA97,\"M\")+1)/12)*M97/I97)),\"\")","v":""},null,{"$f":"N97+W97","v":0},{"$f":"IF($M97>0,($AD97/$M97)*(AJ97+80%*$AM97),0)","v":0},{"$f":"IF($M97>0,($AD97/$M97)*(AK97+20%*$AM97),0)","v":0},{"$f":"IF($M97>0,($AD97/$M97)*(AL97),0)","v":0},{"$f":"IF($M97>0,($AD97/$M97)*AN97,0)","v":0},{"$f":"M97","v":0},null,null,null,null,{"$f":"AI97-AJ97-AK97-AL97-AM97","v":0},{"$f":"IF(M97>0,$N97/$M97*AJ97,0)","v":0},{"$f":"IF(M97>0,$N97/$M97*AK97,0)","v":0},{"$f":"IF(M97>0,$N97/$M97*AL97,0)","v":0},null,{"$f":"SUM(Tabella1[[#This Row],[Contributi dei Comuni (6900)]:[Contributi di Enti privati (fondaz., associaz., coop., SA, donazioni) (6970)]])-Tabella1[[#This Row],[Finanziamento totale]]","v":0}]
[null,null,null,null,null,null,null,null,{"$f":"IFERROR(VLOOKUP(MID(J98,1,SEARCH(\"-\",J98,1)-2),'Codici COIN'!$C$16:$J$27,8,FALSE),\"\")","v":""},null,null,null,0,0,0,null,0,"",0,{"$f":"IF(R98<>\"Sì\",0,IF(J98='Codici COIN'!$I$17,M98,IF(Q98=0,1,IF(H98>0,M98*Q98/I98,0))))","v":0},0,{"$f":"IF(AND(T98=1,S98=0),0,IF(J98='Codici COIN'!$I$17,M98,M98/2))","v":0},{"$f":"V98*Parametri!$B$13*S98/12","v":0},0,null,null,null,"",null,0,0,0,0,0,0,null,null,null,null,0,0,0,0,null,{"$f":"SUM(Tabella1[[#This Row],[Contributi dei Comuni (6900)]:[Contributi di Enti privati (fondaz., associaz., coop., SA, donazioni) (6970)]])-Tabella1[[#This Row],[Finanziamento totale]]","v":0}]
[null,null,null,null,null,null,null,null,{"$f":"IFERROR(VLOOKUP(MID(J99,1,SEARCH(\"-\",J99,1)-2),'Codici COIN'!$C$16:$J$27,8,FALSE),\"\")","v":""},null,null,null,0,0,0,null,0,"",0,{"$f":"IF(R99<>\"Sì\",0,IF(J99='Codici COIN'!$I$17,M99,IF(Q99=0,1,IF(H99>0,M99*Q99/I99,0))))","v":0},0,{"$f":"IF(AND(T99=1,S99=0),0,IF(J99='Codici COIN'!$I$17,M99,M99/2))","v":0},{"$f":"V99*Parametri!$B$13*S99/12","v":0},0,null,null,null,"",null,0,0,0,0,0,0,null,null,null,null,0,0,0,0,null,{"$f":"SUM(Tabella1[[#This Row],[Contributi dei Comuni (6900)]:[Contributi di Enti privati (fondaz., associaz., coop., SA, donazioni) (6970)]])-Tabella1[[#This Row],[Finanziamento totale]]","v":0}]
[null,null,null,null,null,null,null,null,{"$f":"IFERROR(VLOOKUP(MID(J100,1,SEARCH(\"-\",J100,1)-2),'Codici COIN'!$C$16:$J$27,8,FALSE),\"\")","v":""},null,null,null,0,0,0,null,0,"",0,{"$f":"IF(R100<>\"Sì\",0,IF(J100='Codici COIN'!$I$17,M100,IF(Q100=0,1,IF(H100>0,M100*Q100/I100,0))))","v":0},0,{"$f":"IF(AND(T100=1,S100=0),0,IF(J100='Codici COIN'!$I$17,M100,M100/2))","v":0},{"$f":"V100*Parametri!$B$13*S100/12","v":0},0,null,null,null,"",null,0,0,0,0,0,0,null,null,null,null,0,0,0,0,null,{"$f":"SUM(Tabella1[[#This Row],[Contributi dei Comuni (6900)]:[Contributi di Enti privati (fondaz., associaz., coop., SA, donazioni) (6970)]])-Tabella1[[#This Row],[Finanziamento totale]]","v":0}]
[null,null,null,null,null,null,null,null,{"$f":"IFERROR(VLOOKUP(MID(J101,1,SEARCH(\"-\",J101,1)-2),'Codici COIN'!$C$16:$J$27,8,FALSE),\"\")","v":""},null,null,null,0,0,0,null,0,"",0,{"$f":"IF(R101<>\"Sì\",0,IF(J101='Codici COIN'!$I$17,M101,IF(Q101=0,1,IF(H101>0,M101*Q101/I101,0))))","v":0},0,{"$f":"IF(AND(T101=1,S101=0),0,IF(J101='Codici COIN'!$I$17,M101,M101/2))","v":0},{"$f":"V101*Parametri!$B$13*S101/12","v":0},0,null,null,null,"",null,0,0,0,0,0,0,null,null,null,null,0,0,0,0,null,{"$f":"SUM(Tabella1[[#This Row],[Contributi dei Comuni (6900)]:[Contributi di Enti privati (fondaz., associaz., coop., SA, donazioni) (6970)]])-Tabella1[[#This Row],[Finanziamento totale]]","v":0}]
[null,null,null,null,null,null,null,null,{"$f":"IFERROR(VLOOKUP(MID(J102,1,SEARCH(\"-\",J102,1)-2),'Codici COIN'!$C$16:$J$27,8,FALSE),\"\")","v":""},null,null,null,0,0,0,null,0,"",0,{"$f":"IF(R102<>\"Sì\",0,IF(J102='Codici COIN'!$I$17,M102,IF(Q102=0,1,IF(H102>0,M102*Q102/I102,0))))","v":0},0,{"$f":"IF(AND(T102=1,S102=0),0,IF(J102='Codici COIN'!$I$17,M102,M102/2))","v":0},{"$f":"V102*Parametri!$B$13*S102/12","v":0},0,null,null,null,"",null,0,0,0,0,0,0,null,null,null,null,0,0,0,0,null,{"$f":"SUM(Tabella1[[#This Row],[Contributi dei Comuni (6900)]:[Contributi di Enti privati (fondaz., associaz., coop., SA, donazioni) (6970)]])-Tabella1[[#This Row],[Finanziamento totale]]","v":0}]
[null,null,null,null,null,null,null,null,{"$f":"IFERROR(VLOOKUP(MID(J103,1,SEARCH(\"-\",J103,1)-2),'Codici COIN'!$C$16:$J$27,8,FALSE),\"\")","v":""},null,null,null,0,0,{"$f":"N103*Z103","v":0},null,0,"",{"$f":"IF(H103=0,0,IF(R103=\"Sì\",IF(YEAR(H103)=YEAR($G$2),12-MONTH(H103)+1,IF(YEAR(H103)+IF(I103=\"n/a\",999,I103)=YEAR($G$2),MONTH(H103)-1,IF(YEAR(H103)+IF(I103=\"n/a\",999,I103)<YEAR($G$2),0,12))),IF(AND(AA103>0,YEAR(AA103)<YEAR($G$2)),0,MAX(0,MIN(MONTH(AA103),IF(I103=\"n/a\",999,I103)*12-DATEDIF(H103,DATE(YEAR($G$2),1,1),\"M\"))))))","v":0},{"$f":"IF(R103<>\"Sì\",0,IF(J103='Codici COIN'!$I$17,M103,IF(Q103=0,1,IF(H103>0,M103*Q103/I103,0))))","v":0},{"$f":"+T103*Z103","v":0},{"$f":"IF(AND(T103=1,S103=0),0,IF(J103='Codici COIN'!$I$17,M103,M103/2))","v":0},{"$f":"V103*Parametri!$B$13*S103/12","v":0},{"$f":"IF(V103>0,W103*Z103,0)","v":0},null,null,null,{"$f":"IF(AA103>0,IF(I103=\"n/a\",M103,MAX(0,(I103-(DATEDIF(H103,AA103,\"M\")+1)/12)*M103/I103)),\"\")","v":""},null,0,0,0,0,0,0,null,null,null,null,0,0,0,0,null,{"$f":"SUM(Tabella1[[#This Row],[Contributi dei Comuni (6900)]:[Contributi di Enti privati (fondaz., associaz., coop., SA, donazioni) (6970)]])-Tabella1[[#This Row],[Finanziamento totale]]","v":0}]
[null,null,null,null,null,null,null,null,{"$f":"IFERROR(VLOOKUP(MID(J104,1,SEARCH(\"-\",J104,1)-2),'Codici COIN'!$C$16:$J$27,8,FALSE),\"\")","v":""},null,null,null,0,0,{"$f":"N104*Z104","v":0},null,0,"",0,{"$f":"IF(R104<>\"Sì\",0,IF(J104='Codici COIN'!$I$17,M104,IF(Q104=0,1,IF(H104>0,M104*Q104/I104,0))))","v":0},{"$f":"+T104*Z104","v":0},{"$f":"IF(AND(T104=1,S104=0),0,IF(J104='Codici COIN'!$I$17,M104,M104/2))","v":0},{"$f":"V104*Parametri!$B$13*S104/12","v":0},{"$f":"IF(V104>0,W104*Z104,0)","v":0},null,null,null,{"$f":"IF(AA104>0,IF(I104=\"n/a\",M104,MAX(0,(I104-(DATEDIF(H104,AA104,\"M\")+1)/12)*M104/I104)),\"\")","v":""},null,0,0,0,0,0,0,null,null,null,null,0,0,0,0,null,{"$f":"SUM(Tabella1[[#This Row],[Contributi dei Comuni (6900)]:[Contributi di Enti privati (fondaz., associaz., coop., SA, donazioni) (6970)]])-Tabella1[[#This Row],[Finanziamento totale]]","v":0}]
[null,null,null,null,null,null,null,null,{"$f":"IFERROR(VLOOKUP(MID(J105,1,SEARCH(\"-\",J105,1)-2),'Codici COIN'!$C$16:$J$27,8,FALSE),\"\")","v":""},null,null,null,0,0,{"$f":"N105*Z105","v":0},null,0,"",0,{"$f":"IF(R105<>\"Sì\",0,IF(J105='Codici COIN'!$I$17,M105,IF(Q105=0,1,IF(H105>0,M105*Q105/I105,0))))","v":0},{"$f":"+T105*Z105","v":0},{"$f":"IF(AND(T105=1,S105=0),0,IF(J105='Codici COIN'!$I$17,M105,M105/2))","v":0},{"$f":"V105*Parametri!$B$13*S105/12","v":0},{"$f":"IF(V105>0,W105*Z105,0)","v":0},null,null,null,{"$f":"IF(AA105>0,IF(I105=\"n/a\",M105,MAX(0,(I105-(DATEDIF(H105,AA105,\"M\")+1)/12)*M105/I105)),\"\")","v":""},null,0,0,0,0,0,0,null,null,null,null,0,0,0,0,null,{"$f":"SUM(Tabella1[[#This Row],[Contributi dei Comuni (6900)]:[Contributi di Enti privati (fondaz., associaz., coop., SA, donazioni) (6970)]])-Tabella1[[#This Row],[Finanziamento totale]]","v":0}]
[null,null,null,null,null,null,null,null,{"$f":"IFERROR(VLOOKUP(MID(J106,1,SEARCH(\"-\",J106,1)-2),'Codici COIN'!$C$16:$J$27,8,FALSE),\"\")","v":""},null,null,null,0,0,{"$f":"N106*Z106","v":0},null,0,"",0,{"$f":"IF(R106<>\"Sì\",0,IF(J106='Codici COIN'!$I$17,M106,IF(Q106=0,1,IF(H106>0,M106*Q106/I106,0))))","v":0},{"$f":"+T106*Z106","v":0},{"$f":"IF(AND(T106=1,S106=0),0,IF(J106='Codici COIN'!$I$17,M106,M106/2))","v":0},{"$f":"V106*Parametri!$B$13*S106/12","v":0},{"$f":"IF(V106>0,W106*Z106,0)","v":0},null,null,null,{"$f":"IF(AA106>0,IF(I106=\"n/a\",M106,MAX(0,(I106-(DATEDIF(H106,AA106,\"M\")+1)/12)*M106/I106)),\"\")","v":""},null,0,0,0,0,0,0,null,null,null,null,0,0,0,0,null,{"$f":"SUM(Tabella1[[#This Row],[Contributi dei Comuni (6900)]:[Contributi di Enti privati (fondaz., associaz., coop., SA, donazioni) (6970)]])-Tabella1[[#This Row],[Finanziamento totale]]","v":0}]
["Totale",null,null,null,null,null,null,null,null,null,null,null,{"$f":"SUM(M7:M106)","v":27345500},{"$f":"SUM(N7:N106)","v":822589.39393939392},{"$f":"SUM(O7:O106)","v":0},null,null,null,null,{"$f":"SUM(T7:T106)","v":12831559.090909092},0,15697750,580095.25,0,1000,null,null,{"$f":"SUM(AB7:AB106)","v":0},null,{"$f":"SUM(AD7:AD106)","v":1402684.643939394},146489.15151515149,486115.06818181812,234254.54545454547,535825.8787878789,27345500,1200000,9303500,4800000,1464000,10578000,36363.636363636368,292018.93939393945,145454.54545454547]

{"sheet":"Resoconti COIN","index":12,"n_rows":138,"n_cols":16,"rows_kept":138,"cut":false,"hidden":false,"merged":[[104,7,104,8],[104,9,104,11],[104,12,104,14],[3,3,3,4],[3,5,3,6],[4,7,4,8],[4,9,4,11],[4,12,4,14],[103,3,103,4],[103,5,103,6],[3,7,3,14],[53,3,53,5],[53,6,53,8],[103,7,103,14],[53,9,53,11],[53,12,53,13]]}
["Resoconto contabilità investimenti per UACD (in CHF)"]
[{"$f":"Parametri!$B$7","v":2021},null,{"$f":"Parametri!$B$3","v":"ESEMPIO - CPA STANDARD CON CAT-STT"}]
[]
[null,null,null,"Valore immobilizzazioni",null,"Valore dopo ammortamento",null,"Costi annuali di utilizzo delle immobilizzazioni ",null,null,null,null,null,null,null,"Canoni di locazione"]
[null,null,null,"Totale ","Contributi","al 31.12 ","di cui","Ammortamenti calcolatori",null,"Interessi calcolatori (sul valore medio)",null,null,"Costi annuali di utilizzo ",null,null,"Totale"]
["CdC COAN \nTI 2021","CdC SOMED 2021","Denominazione del CdC\n","Valore \niniziale","d'investimento (alla data iniziale)",null,"riconosciuti LAMal","Ammortamenti totali","di cui riconosciuti LAMal","Valore investimento per calcolo interessi","Interessi calcolatori totali","di cui riconosciuti LAMal","Totale costi","di cui riconosciuti LAMal","(in %)","cespiti non iscritti a bilancio"]
[]
["Totale CdC generali",null,null,{"$f":"SUM(D9:D19)","v":25488500},15018500,11458314.772727273,0,684013.63636363635,0,14769250,546462.25,0,1230475.8863636362,0,{"$f":"IF(N8>0,+N8/M8,0)","v":0},{"$f":"SUM(P9:P19)","v":1000}]
[{"$f":"'Codici COIN'!B42","v":"010"},{"$f":"'Codici COIN'!C42","v":"010"},{"$f":"'Codici COIN'!E42","v":"Edifici"},{"$f":"SUMIFS(Tabella1[Valore iniziale totale d''investimento],Tabella1[Centro di costo*],$A9&\" - \"&$C9,Tabella1[Identificativo investimento*],\"<>X\")","v":25050000},{"$f":"SUMIFS(Tabella1[Contributi dei Comuni (6900)],Tabella1[Centro di costo*],$A9&\" - \"&$C9,Tabella1[Identificativo investimento*],\"<>X\")+SUMIFS(Tabella1[Contributi dei Cantoni (6950)],Tabella1[Centro di costo*],$A9&\" - \"&$C9,Tabella1[Identificativo investimento*],\"<>X\")+SUMIFS(Tabella1[Contributi della Confederazione (6960)],Tabella1[Centro di costo*],$A9&\" - \"&$C9,Tabella1[Identificativo investimento*],\"<>X\")+SUMIFS(Tabella1[Utilizzo fondo 3 manutenzione e investimenti],Tabella1[Centro di costo*],$A9&\" - \"&$C9,Tabella1[Identificativo investimento*],\"<>X\")","v":14600000},{"$f":"SUMIFS(Tabella1[Val. invest. al 31.12. dopo ammortamento],Tabella1[Centro di costo*],$A9&\" - \"&$C9,Tabella1[Identificativo investimento*],\"<>X\")","v":11239393.939393941},{"$f":"SUMIFS(Tabella1[Val. invest. LAMal dopo ammort. senza amm. eccess.],Tabella1[Centro di costo*],$A9&\" - \"&$C9,Tabella1[Identificativo investimento*],\"<>X\")","v":0},{"$f":"SUMIFS(Tabella1[Ammortamento calcolatorio annuo],Tabella1[Centro di costo*],$A9&\" - \"&$C9,Tabella1[Identificativo investimento*],\"<>X\")","v":636363.63636363635},{"$f":"SUMIFS(Tabella1[Ammortamento calcolatorio annuo, riconosciuto  LAMal],Tabella1[Centro di costo*],$A9&\" - \"&$C9,Tabella1[Identificativo investimento*],\"<>X\")","v":0},{"$f":"SUMIFS(Tabella1[Val. invest. per calcolo interessi],Tabella1[Centro di costo*],$A9&\" - \"&$C9,Tabella1[Identificativo investimento*],\"<>X\")","v":14550000},{"$f":"SUMIFS(Tabella1[Interessi calcolatori annui],Tabella1[Centro di costo*],$A9&\" - \"&$C9,Tabella1[Identificativo investimento*],\"<>X\")","v":538350},{"$f":"SUMIFS(Tabella1[Interessi calcolatori annui, riconosciuti LAMal],Tabella1[Centro di costo*],$A9&\" - \"&$C9,Tabella1[Identificativo investimento*],\"<>X\")","v":0},{"$f":"H9+K9","v":1174713.6363636362},{"$f":"+I9+L9","v":0},{"$f":"IF(N9>0,+N9/M9,0)","v":0},{"$f":"SUMIFS(Tabella1[Canone di locazione COAN-COIN],Tabella1[Centro di costo*],$A9&\" - \"&$C9,Tabella1[Identificativo investimento*],\"X\")","v":0}]
[{"$f":"'Codici COIN'!B43","v":"011"},{"$f":"'Codici COIN'!C43","v":"015"},{"$f":"'Codici COIN'!E43","v":"Energia"},{"$f":"SUMIFS(Tabella1[Valore iniziale totale d''investimento],Tabella1[Centro di costo*],$A10&\" - \"&$C10,Tabella1[Identificativo investimento*],\"<>X\")","v":90000},{"$f":"SUMIFS(Tabella1[Contributi dei Comuni (6900)],Tabella1[Centro di costo*],$A10&\" - \"&$C10,Tabella1[Identificativo investimento*],\"<>X\")+SUMIFS(Tabella1[Contributi dei Cantoni (6950)],Tabella1[Centro di costo*],$A10&\" - \"&$C10,Tabella1[Identificativo investimento*],\"<>X\")+SUMIFS(Tabella1[Contributi della Confederazione (6960)],Tabella1[Centro di costo*],$A10&\" - \"&$C10,Tabella1[Identificativo investimento*],\"<>X\")+SUMIFS(Tabella1[Utilizzo fondo 3 manutenzione e investimenti],Tabella1[Centro di costo*],$A10&\" - \"&$C10,Tabella1[Identificativo investimento*],\"<>X\")","v":90000},{"$f":"SUMIFS(Tabella1[Val. invest. al 31.12. dopo ammortamento],Tabella1[Centro di costo*],$A10&\" - \"&$C10,Tabella1[Identificativo investimento*],\"<>X\")","v":62625},{"$f":"SUMIFS(Tabella1[Val. invest. LAMal dopo ammort. senza amm. eccess.],Tabella1[Centro di costo*],$A10&\" - \"&$C10,Tabella1[Identificativo investimento*],\"<>X\")","v":0},{"$f":"SUMIFS(Tabella1[Ammortamento calcolatorio annuo],Tabella1[Centro di costo*],$A10&\" - \"&$C10,Tabella1[Identificativo investimento*],\"<>X\")","v":4500},{"$f":"SUMIFS(Tabella1[Ammortamento calcolatorio annuo, riconosciuto  LAMal],Tabella1[Centro di costo*],$A10&\" - \"&$C10,Tabella1[Identificativo investimento*],\"<>X\")","v":0},{"$f":"SUMIFS(Tabella1[Val. invest. per calcolo interessi],Tabella1[Centro di costo*],$A10&\" - \"&$C10,Tabella1[Identificativo investimento*],\"<>X\")","v":45000},{"$f":"SUMIFS(Tabella1[Interessi calcolatori annui],Tabella1[Centro di costo*],$A10&\" - \"&$C10,Tabella1[Identificativo investimento*],\"<>X\")","v":1665},{"$f":"SUMIFS(Tabella1[Interessi calcolatori annui, riconosciuti LAMal],Tabella1[Centro di costo*],$A10&\" - \"&$C10,Tabella1[Identificativo investimento*],\"<>X\")","v":0},6165,{"$f":"+I10+L10","v":0},{"$f":"IF(N10>0,+N10/M10,0)","v":0},{"$f":"SUMIFS(Tabella1[Canone di locazione COAN-COIN],Tabella1[Centro di costo*],$A10&\" - \"&$C10,Tabella1[Identificativo investimento*],\"X\")","v":0}]
[{"$f":"'Codici COIN'!B44","v":"020"},{"$f":"'Codici COIN'!C44","v":"020"},{"$f":"'Codici COIN'!E44","v":"Servizio tecnico"},{"$f":"SUMIFS(Tabella1[Valore iniziale totale d''investimento],Tabella1[Centro di costo*],$A11&\" - \"&$C11,Tabella1[Identificativo investimento*],\"<>X\")","v":120000},{"$f":"SUMIFS(Tabella1[Contributi dei Comuni (6900)],Tabella1[Centro di costo*],$A11&\" - \"&$C11,Tabella1[Identificativo investimento*],\"<>X\")+SUMIFS(Tabella1[Contributi dei Cantoni (6950)],Tabella1[Centro di costo*],$A11&\" - \"&$C11,Tabella1[Identificativo investimento*],\"<>X\")+SUMIFS(Tabella1[Contributi della Confederazione (6960)],Tabella1[Centro di costo*],$A11&\" - \"&$C11,Tabella1[Identificativo investimento*],\"<>X\")+SUMIFS(Tabella1[Utilizzo fondo 3 manutenzione e investimenti],Tabella1[Centro di costo*],$A11&\" - \"&$C11,Tabella1[Identificativo investimento*],\"<>X\")","v":120000},{"$f":"SUMIFS(Tabella1[Val. invest. al 31.12. dopo ammortamento],Tabella1[Centro di costo*],$A11&\" - \"&$C11,Tabella1[Identificativo investimento*],\"<>X\")","v":70000},{"$f":"SUMIFS(Tabella1[Val. invest. LAMal dopo ammort. senza amm. eccess.],Tabella1[Centro di costo*],$A11&\" - \"&$C11,Tabella1[Identificativo investimento*],\"<>X\")","v":0},{"$f":"SUMIFS(Tabella1[Ammortamento calcolatorio annuo],Tabella1[Centro di costo*],$A11&\" - \"&$C11,Tabella1[Identificativo investimento*],\"<>X\")","v":6000},{"$f":"SUMIFS(Tabella1[Ammortamento calcolatorio annuo, riconosciuto  LAMal],Tabella1[Centro di costo*],$A11&\" - \"&$C11,Tabella1[Identificativo investimento*],\"<>X\")","v":0},{"$f":"SUMIFS(Tabella1[Val. invest. per calcolo interessi],Tabella1[Centro di costo*],$A11&\" - \"&$C11,Tabella1[Identificativo investimento*],\"<>X\")","v":60000},{"$f":"SUMIFS(Tabella1[Interessi calcolatori annui],Tabella1[Centro di costo*],$A11&\" - \"&$C11,Tabella1[Identificativo investimento*],\"<>X\")","v":2220},{"$f":"SUMIFS(Tabella1[Interessi calcolatori annui, riconosciuti LAMal],Tabella1[Centro di costo*],$A11&\" - \"&$C11,Tabella1[Identificativo investimento*],\"<>X\")","v":0},8220,0,0,{"$f":"SUMIFS(Tabella1[Canone di locazione COAN-COIN],Tabella1[Centro di costo*],$A11&\" - \"&$C11,Tabella1[Identificativo investimento*],\"X\")","v":0}]
[{"$f":"'Codici COIN'!B45","v":"021"},{"$f":"'Codici COIN'!C45","v":"021"},{"$f":"'Codici COIN'!E45","v":"Servizio trasporti"},{"$f":"SUMIFS(Tabella1[Valore iniziale totale d''investimento],Tabella1[Centro di costo*],$A12&\" - \"&$C12,Tabella1[Identificativo investimento*],\"<>X\")","v":40000},{"$f":"SUMIFS(Tabella1[Contributi dei Comuni (6900)],Tabella1[Centro di costo*],$A12&\" - \"&$C12,Tabella1[Identificativo investimento*],\"<>X\")+SUMIFS(Tabella1[Contributi dei Cantoni (6950)],Tabella1[Centro di costo*],$A12&\" - \"&$C12,Tabella1[Identificativo investimento*],\"<>X\")+SUMIFS(Tabella1[Contributi della Confederazione (6960)],Tabella1[Centro di costo*],$A12&\" - \"&$C12,Tabella1[Identificativo investimento*],\"<>X\")+SUMIFS(Tabella1[Utilizzo fondo 3 manutenzione e investimenti],Tabella1[Centro di costo*],$A12&\" - \"&$C12,Tabella1[Identificativo investimento*],\"<>X\")","v":20000},{"$f":"SUMIFS(Tabella1[Val. invest. al 31.12. dopo ammortamento],Tabella1[Centro di costo*],$A12&\" - \"&$C12,Tabella1[Identificativo investimento*],\"<>X\")","v":26666.666666666664},{"$f":"SUMIFS(Tabella1[Val. invest. LAMal dopo ammort. senza amm. eccess.],Tabella1[Centro di costo*],$A12&\" - \"&$C12,Tabella1[Identificativo investimento*],\"<>X\")","v":0},{"$f":"SUMIFS(Tabella1[Ammortamento calcolatorio annuo],Tabella1[Centro di costo*],$A12&\" - \"&$C12,Tabella1[Identificativo investimento*],\"<>X\")","v":8000},{"$f":"SUMIFS(Tabella1[Ammortamento calcolatorio annuo, riconosciuto  LAMal],Tabella1[Centro di costo*],$A12&\" - \"&$C12,Tabella1[Identificativo investimento*],\"<>X\")","v":0},{"$f":"SUMIFS(Tabella1[Val. invest. per calcolo interessi],Tabella1[Centro di costo*],$A12&\" - \"&$C12,Tabella1[Identificativo investimento*],\"<>X\")","v":20000},{"$f":"SUMIFS(Tabella1[Interessi calcolatori annui],Tabella1[Centro di costo*],$A12&\" - \"&$C12,Tabella1[Identificativo investimento*],\"<>X\")","v":740},{"$f":"SUMIFS(Tabella1[Interessi calcolatori annui, riconosciuti LAMal],Tabella1[Centro di costo*],$A12&\" - \"&$C12,Tabella1[Identificativo investimento*],\"<>X\")","v":0},8740,0,0,{"$f":"SUMIFS(Tabella1[Canone di locazione COAN-COIN],Tabella1[Centro di costo*],$A12&\" - \"&$C12,Tabella1[Identificativo investimento*],\"X\")","v":0}]
[{"$f":"'Codici COIN'!B46","v":"030"},{"$f":"'Codici COIN'!C46","v":"030"},{"$f":"'Codici COIN'!E46","v":"Direzione e amministrazione"},{"$f":"SUMIFS(Tabella1[Valore iniziale totale d''investimento],Tabella1[Centro di costo*],$A13&\" - \"&$C13,Tabella1[Identificativo investimento*],\"<>X\")","v":100000},{"$f":"SUMIFS(Tabella1[Contributi dei Comuni (6900)],Tabella1[Centro di costo*],$A13&\" - \"&$C13,Tabella1[Identificativo investimento*],\"<>X\")+SUMIFS(Tabella1[Contributi dei Cantoni (6950)],Tabella1[Centro di costo*],$A13&\" - \"&$C13,Tabella1[Identificativo investimento*],\"<>X\")+SUMIFS(Tabella1[Contributi della Confederazione (6960)],Tabella1[Centro di costo*],$A13&\" - \"&$C13,Tabella1[Identificativo investimento*],\"<>X\")+SUMIFS(Tabella1[Utilizzo fondo 3 manutenzione e investimenti],Tabella1[Centro di costo*],$A13&\" - \"&$C13,Tabella1[Identificativo investimento*],\"<>X\")","v":100000},{"$f":"SUMIFS(Tabella1[Val. invest. al 31.12. dopo ammortamento],Tabella1[Centro di costo*],$A13&\" - \"&$C13,Tabella1[Identificativo investimento*],\"<>X\")","v":26979.166666666664},{"$f":"SUMIFS(Tabella1[Val. invest. LAMal dopo ammort. senza amm. eccess.],Tabella1[Centro di costo*],$A13&\" - \"&$C13,Tabella1[Identificativo investimento*],\"<>X\")","v":0},{"$f":"SUMIFS(Tabella1[Ammortamento calcolatorio annuo],Tabella1[Centro di costo*],$A13&\" - \"&$C13,Tabella1[Identificativo investimento*],\"<>X\")","v":19750},{"$f":"SUMIFS(Tabella1[Ammortamento calcolatorio annuo, riconosciuto  LAMal],Tabella1[Centro di costo*],$A13&\" - \"&$C13,Tabella1[Identificativo investimento*],\"<>X\")","v":0},{"$f":"SUMIFS(Tabella1[Val. invest. per calcolo interessi],Tabella1[Centro di costo*],$A13&\" - \"&$C13,Tabella1[Identificativo investimento*],\"<>X\")","v":50000},{"$f":"SUMIFS(Tabella1[Interessi calcolatori annui],Tabella1[Centro di costo*],$A13&\" - \"&$C13,Tabella1[Identificativo investimento*],\"<>X\")","v":1850},{"$f":"SUMIFS(Tabella1[Interessi calcolatori annui, riconosciuti LAMal],Tabella1[Centro di costo*],$A13&\" - \"&$C13,Tabella1[Identificativo investimento*],\"<>X\")","v":0},21600,0,0,{"$f":"SUMIFS(Tabella1[Canone di locazione COAN-COIN],Tabella1[Centro di costo*],$A13&\" - \"&$C13,Tabella1[Identificativo investimento*],\"X\")","v":1000}]
[{"$f":"'Codici COIN'!B47","v":"040"},{"$f":"'Codici COIN'!C47","v":"040"},{"$f":"'Codici COIN'!E47","v":"Economia domestica in generale"},{"$f":"SUMIFS(Tabella1[Valore iniziale totale d''investimento],Tabella1[Centro di costo*],$A14&\" - \"&$C14,Tabella1[Identificativo investimento*],\"<>X\")","v":0},{"$f":"SUMIFS(Tabella1[Contributi dei Comuni (6900)],Tabella1[Centro di costo*],$A14&\" - \"&$C14,Tabella1[Identificativo investimento*],\"<>X\")+SUMIFS(Tabella1[Contributi dei Cantoni (6950)],Tabella1[Centro di costo*],$A14&\" - \"&$C14,Tabella1[Identificativo investimento*],\"<>X\")+SUMIFS(Tabella1[Contributi della Confederazione (6960)],Tabella1[Centro di costo*],$A14&\" - \"&$C14,Tabella1[Identificativo investimento*],\"<>X\")+SUMIFS(Tabella1[Utilizzo fondo 3 manutenzione e investimenti],Tabella1[Centro di costo*],$A14&\" - \"&$C14,Tabella1[Identificativo investimento*],\"<>X\")","v":0},{"$f":"SUMIFS(Tabella1[Val. invest. al 31.12. dopo ammortamento],Tabella1[Centro di costo*],$A14&\" - \"&$C14,Tabella1[Identificativo investimento*],\"<>X\")","v":0},{"$f":"SUMIFS(Tabella1[Val. invest. LAMal dopo ammort. senza amm. eccess.],Tabella1[Centro di costo*],$A14&\" - \"&$C14,Tabella1[Identificativo investimento*],\"<>X\")","v":0},{"$f":"SUMIFS(Tabella1[Ammortamento calcolatorio annuo],Tabella1[Centro di costo*],$A14&\" - \"&$C14,Tabella1[Identificativo investimento*],\"<>X\")","v":0},{"$f":"SUMIFS(Tabella1[Ammortamento calcolatorio annuo, riconosciuto  LAMal],Tabella1[Centro di costo*],$A14&\" - \"&$C14,Tabella1[Identificativo investimento*],\"<>X\")","v":0},{"$f":"SUMIFS(Tabella1[Val. invest. per calcolo interessi],Tabella1[Centro di costo*],$A14&\" - \"&$C14,Tabella1[Identificativo investimento*],\"<>X\")","v":0},{"$f":"SUMIFS(Tabella1[Interessi calcolatori annui],Tabella1[Centro di costo*],$A14&\" - \"&$C14,Tabella1[Identificativo investimento*],\"<>X\")","v":0},{"$f":"SUMIFS(Tabella1[Interessi calcolatori annui, riconosciuti LAMal],Tabella1[Centro di costo*],$A14&\" - \"&$C14,Tabella1[Identificativo investimento*],\"<>X\")","v":0},0,0,0,{"$f":"SUMIFS(Tabella1[Canone di locazione COAN-COIN],Tabella1[Centro di costo*],$A14&\" - \"&$C14,Tabella1[Identificativo investimento*],\"X\")","v":0}]
[{"$f":"'Codici COIN'!B48","v":"041"},{"$f":"'Codici COIN'!C48","v":"041"},{"$f":"'Codici COIN'!E48","v":"Lavanderia"},{"$f":"SUMIFS(Tabella1[Valore iniziale totale d''investimento],Tabella1[Centro di costo*],$A15&\" - \"&$C15,Tabella1[Identificativo investimento*],\"<>X\")","v":33000},{"$f":"SUMIFS(Tabella1[Contributi dei Comuni (6900)],Tabella1[Centro di costo*],$A15&\" - \"&$C15,Tabella1[Identificativo investimento*],\"<>X\")+SUMIFS(Tabella1[Contributi dei Cantoni (6950)],Tabella1[Centro di costo*],$A15&\" - \"&$C15,Tabella1[Identificativo investimento*],\"<>X\")+SUMIFS(Tabella1[Contributi della Confederazione (6960)],Tabella1[Centro di costo*],$A15&\" - \"&$C15,Tabella1[Identificativo investimento*],\"<>X\")+SUMIFS(Tabella1[Utilizzo fondo 3 manutenzione e investimenti],Tabella1[Centro di costo*],$A15&\" - \"&$C15,Tabella1[Identificativo investimento*],\"<>X\")","v":33000},{"$f":"SUMIFS(Tabella1[Val. invest. al 31.12. dopo ammortamento],Tabella1[Centro di costo*],$A15&\" - \"&$C15,Tabella1[Identificativo investimento*],\"<>X\")","v":7150.0000000000018},{"$f":"SUMIFS(Tabella1[Val. invest. LAMal dopo ammort. senza amm. eccess.],Tabella1[Centro di costo*],$A15&\" - \"&$C15,Tabella1[Identificativo investimento*],\"<>X\")","v":0},{"$f":"SUMIFS(Tabella1[Ammortamento calcolatorio annuo],Tabella1[Centro di costo*],$A15&\" - \"&$C15,Tabella1[Identificativo investimento*],\"<>X\")","v":3300},{"$f":"SUMIFS(Tabella1[Ammortamento calcolatorio annuo, riconosciuto  LAMal],Tabella1[Centro di costo*],$A15&\" - \"&$C15,Tabella1[Identificativo investimento*],\"<>X\")","v":0},{"$f":"SUMIFS(Tabella1[Val. invest. per calcolo interessi],Tabella1[Centro di costo*],$A15&\" - \"&$C15,Tabella1[Identificativo investimento*],\"<>X\")","v":16500},{"$f":"SUMIFS(Tabella1[Interessi calcolatori annui],Tabella1[Centro di costo*],$A15&\" - \"&$C15,Tabella1[Identificativo investimento*],\"<>X\")","v":610.5},{"$f":"SUMIFS(Tabella1[Interessi calcolatori annui, riconosciuti LAMal],Tabella1[Centro di costo*],$A15&\" - \"&$C15,Tabella1[Identificativo investimento*],\"<>X\")","v":0},3910.5,0,0,{"$f":"SUMIFS(Tabella1[Canone di locazione COAN-COIN],Tabella1[Centro di costo*],$A15&\" - \"&$C15,Tabella1[Identificativo investimento*],\"X\")","v":0}]
[{"$f":"'Codici COIN'!B49","v":"042"},{"$f":"'Codici COIN'!C49","v":"042"},{"$f":"'Codici COIN'!E49","v":"Pulizia"},{"$f":"SUMIFS(Tabella1[Valore iniziale totale d''investimento],Tabella1[Centro di costo*],$A16&\" - \"&$C16,Tabella1[Identificativo investimento*],\"<>X\")","v":5500},{"$f":"SUMIFS(Tabella1[Contributi dei Comuni (6900)],Tabella1[Centro di costo*],$A16&\" - \"&$C16,Tabella1[Identificativo investimento*],\"<>X\")+SUMIFS(Tabella1[Contributi dei Cantoni (6950)],Tabella1[Centro di costo*],$A16&\" - \"&$C16,Tabella1[Identificativo investimento*],\"<>X\")+SUMIFS(Tabella1[Contributi della Confederazione (6960)],Tabella1[Centro di costo*],$A16&\" - \"&$C16,Tabella1[Identificativo investimento*],\"<>X\")+SUMIFS(Tabella1[Utilizzo fondo 3 manutenzione e investimenti],Tabella1[Centro di costo*],$A16&\" - \"&$C16,Tabella1[Identificativo investimento*],\"<>X\")","v":5500},{"$f":"SUMIFS(Tabella1[Val. invest. al 31.12. dopo ammortamento],Tabella1[Centro di costo*],$A16&\" - \"&$C16,Tabella1[Identificativo investimento*],\"<>X\")","v":3483.3333333333335},{"$f":"SUMIFS(Tabella1[Val. invest. LAMal dopo ammort. senza amm. eccess.],Tabella1[Centro di costo*],$A16&\" - \"&$C16,Tabella1[Identificativo investimento*],\"<>X\")","v":0},{"$f":"SUMIFS(Tabella1[Ammortamento calcolatorio annuo],Tabella1[Centro di costo*],$A16&\" - \"&$C16,Tabella1[Identificativo investimento*],\"<>X\")","v":1100},{"$f":"SUMIFS(Tabella1[Ammortamento calcolatorio annuo, riconosciuto  LAMal],Tabella1[Centro di costo*],$A16&\" - \"&$C16,Tabella1[Identificativo investimento*],\"<>X\")","v":0},{"$f":"SUMIFS(Tabella1[Val. invest. per calcolo interessi],Tabella1[Centro di costo*],$A16&\" - \"&$C16,Tabella1[Identificativo investimento*],\"<>X\")","v":2750},{"$f":"SUMIFS(Tabella1[Interessi calcolatori annui],Tabella1[Centro di costo*],$A16&\" - \"&$C16,Tabella1[Identificativo investimento*],\"<>X\")","v":101.75},{"$f":"SUMIFS(Tabella1[Interessi calcolatori annui, riconosciuti LAMal],Tabella1[Centro di costo*],$A16&\" - \"&$C16,Tabella1[Identificativo investimento*],\"<>X\")","v":0},1201.75,0,0,{"$f":"SUMIFS(Tabella1[Canone di locazione COAN-COIN],Tabella1[Centro di costo*],$A16&\" - \"&$C16,Tabella1[Identificativo investimento*],\"X\")","v":0}]
[{"$f":"'Codici COIN'!B50","v":"060"},{"$f":"'Codici COIN'!C50","v":"060"},{"$f":"'Codici COIN'!E50","v":"Cucina"},{"$f":"SUMIFS(Tabella1[Valore iniziale totale d''investimento],Tabella1[Centro di costo*],$A17&\" - \"&$C17,Tabella1[Identificativo investimento*],\"<>X\")","v":38000},{"$f":"SUMIFS(Tabella1[Contributi dei Comuni (6900)],Tabella1[Centro di costo*],$A17&\" - \"&$C17,Tabella1[Identificativo investimento*],\"<>X\")+SUMIFS(Tabella1[Contributi dei Cantoni (6950)],Tabella1[Centro di costo*],$A17&\" - \"&$C17,Tabella1[Identificativo investimento*],\"<>X\")+SUMIFS(Tabella1[Contributi della Confederazione (6960)],Tabella1[Centro di costo*],$A17&\" - \"&$C17,Tabella1[Identificativo investimento*],\"<>X\")+SUMIFS(Tabella1[Utilizzo fondo 3 manutenzione e investimenti],Tabella1[Centro di costo*],$A17&\" - \"&$C17,Tabella1[Identificativo investimento*],\"<>X\")","v":38000},{"$f":"SUMIFS(Tabella1[Val. invest. al 31.12. dopo ammortamento],Tabella1[Centro di costo*],$A17&\" - \"&$C17,Tabella1[Identificativo investimento*],\"<>X\")","v":15516.666666666666},{"$f":"SUMIFS(Tabella1[Val. invest. LAMal dopo ammort. senza amm. eccess.],Tabella1[Centro di costo*],$A17&\" - \"&$C17,Tabella1[Identificativo investimento*],\"<>X\")","v":0},{"$f":"SUMIFS(Tabella1[Ammortamento calcolatorio annuo],Tabella1[Centro di costo*],$A17&\" - \"&$C17,Tabella1[Identificativo investimento*],\"<>X\")","v":3800},{"$f":"SUMIFS(Tabella1[Ammortamento calcolatorio annuo, riconosciuto  LAMal],Tabella1[Centro di costo*],$A17&\" - \"&$C17,Tabella1[Identificativo investimento*],\"<>X\")","v":0},{"$f":"SUMIFS(Tabella1[Val. invest. per calcolo interessi],Tabella1[Centro di costo*],$A17&\" - \"&$C17,Tabella1[Identificativo investimento*],\"<>X\")","v":19000},{"$f":"SUMIFS(Tabella1[Interessi calcolatori annui],Tabella1[Centro di costo*],$A17&\" - \"&$C17,Tabella1[Identificativo investimento*],\"<>X\")","v":703},{"$f":"SUMIFS(Tabella1[Interessi calcolatori annui, riconosciuti LAMal],Tabella1[Centro di costo*],$A17&\" - \"&$C17,Tabella1[Identificativo investimento*],\"<>X\")","v":0},4503,0,0,{"$f":"SUMIFS(Tabella1[Canone di locazione COAN-COIN],Tabella1[Centro di costo*],$A17&\" - \"&$C17,Tabella1[Identificativo investimento*],\"X\")","v":0}]
[{"$f":"'Codici COIN'!B51","v":"090"},{"$f":"'Codici COIN'!C51","v":"090"},{"$f":"'Codici COIN'!E51","v":"Magazzino centrale"},{"$f":"SUMIFS(Tabella1[Valore iniziale totale d''investimento],Tabella1[Centro di costo*],$A18&\" - \"&$C18,Tabella1[Identificativo investimento*],\"<>X\")","v":0},{"$f":"SUMIFS(Tabella1[Contributi dei Comuni (6900)],Tabella1[Centro di costo*],$A18&\" - \"&$C18,Tabella1[Identificativo investimento*],\"<>X\")+SUMIFS(Tabella1[Contributi dei Cantoni (6950)],Tabella1[Centro di costo*],$A18&\" - \"&$C18,Tabella1[Identificativo investimento*],\"<>X\")+SUMIFS(Tabella1[Contributi della Confederazione (6960)],Tabella1[Centro di costo*],$A18&\" - \"&$C18,Tabella1[Identificativo investimento*],\"<>X\")+SUMIFS(Tabella1[Utilizzo fondo 3 manutenzione e investimenti],Tabella1[Centro di costo*],$A18&\" - \"&$C18,Tabella1[Identificativo investimento*],\"<>X\")","v":0},{"$f":"SUMIFS(Tabella1[Val. invest. al 31.12. dopo ammortamento],Tabella1[Centro di costo*],$A18&\" - \"&$C18,Tabella1[Identificativo investimento*],\"<>X\")","v":0},{"$f":"SUMIFS(Tabella1[Val. invest. LAMal dopo ammort. senza amm. eccess.],Tabella1[Centro di costo*],$A18&\" - \"&$C18,Tabella1[Identificativo investimento*],\"<>X\")","v":0},{"$f":"SUMIFS(Tabella1[Ammortamento calcolatorio annuo],Tabella1[Centro di costo*],$A18&\" - \"&$C18,Tabella1[Identificativo investimento*],\"<>X\")","v":0},{"$f":"SUMIFS(Tabella1[Ammortamento calcolatorio annuo, riconosciuto  LAMal],Tabella1[Centro di costo*],$A18&\" - \"&$C18,Tabella1[Identificativo investimento*],\"<>X\")","v":0},{"$f":"SUMIFS(Tabella1[Val. invest. per calcolo interessi],Tabella1[Centro di costo*],$A18&\" - \"&$C18,Tabella1[Identificativo investimento*],\"<>X\")","v":0},{"$f":"SUMIFS(Tabella1[Interessi calcolatori annui],Tabella1[Centro di costo*],$A18&\" - \"&$C18,Tabella1[Identificativo investimento*],\"<>X\")","v":0},{"$f":"SUMIFS(Tabella1[Interessi calcolatori annui, riconosciuti LAMal],Tabella1[Centro di costo*],$A18&\" - \"&$C18,Tabella1[Identificativo investimento*],\"<>X\")","v":0},0,0,0,{"$f":"SUMIFS(Tabella1[Canone di locazione COAN-COIN],Tabella1[Centro di costo*],$A18&\" - \"&$C18,Tabella1[Identificativo investimento*],\"X\")","v":0}]
[{"$f":"'Codici COIN'!B52","v":"095"},{"$f":"'Codici COIN'!C52","v":"095"},{"$f":"'Codici COIN'!E52","v":"Farmacia"},{"$f":"SUMIFS(Tabella1[Valore iniziale totale d''investimento],Tabella1[Centro di costo*],$A19&\" - \"&$C19,Tabella1[Identificativo investimento*],\"<>X\")","v":12000},{"$f":"SUMIFS(Tabella1[Contributi dei Comuni (6900)],Tabella1[Centro di costo*],$A19&\" - \"&$C19,Tabella1[Identificativo investimento*],\"<>X\")+SUMIFS(Tabella1[Contributi dei Cantoni (6950)],Tabella1[Centro di costo*],$A19&\" - \"&$C19,Tabella1[Identificativo investimento*],\"<>X\")+SUMIFS(Tabella1[Contributi della Confederazione (6960)],Tabella1[Centro di costo*],$A19&\" - \"&$C19,Tabella1[Identificativo investimento*],\"<>X\")+SUMIFS(Tabella1[Utilizzo fondo 3 manutenzione e investimenti],Tabella1[Centro di costo*],$A19&\" - \"&$C19,Tabella1[Identificativo investimento*],\"<>X\")","v":12000},{"$f":"SUMIFS(Tabella1[Val. invest. al 31.12. dopo ammortamento],Tabella1[Centro di costo*],$A19&\" - \"&$C19,Tabella1[Identificativo investimento*],\"<>X\")","v":6500},{"$f":"SUMIFS(Tabella1[Val. invest. LAMal dopo ammort. senza amm. eccess.],Tabella1[Centro di costo*],$A19&\" - \"&$C19,Tabella1[Identificativo investimento*],\"<>X\")","v":0},{"$f":"SUMIFS(Tabella1[Ammortamento calcolatorio annuo],Tabella1[Centro di costo*],$A19&\" - \"&$C19,Tabella1[Identificativo investimento*],\"<>X\")","v":1200},{"$f":"SUMIFS(Tabella1[Ammortamento calcolatorio annuo, riconosciuto  LAMal],Tabella1[Centro di costo*],$A19&\" - \"&$C19,Tabella1[Identificativo investimento*],\"<>X\")","v":0},{"$f":"SUMIFS(Tabella1[Val. invest. per calcolo interessi],Tabella1[Centro di costo*],$A19&\" - \"&$C19,Tabella1[Identificativo investimento*],\"<>X\")","v":6000},{"$f":"SUMIFS(Tabella1[Interessi calcolatori annui],Tabella1[Centro di costo*],$A19&\" - \"&$C19,Tabella1[Identificativo investimento*],\"<>X\")","v":222},{"$f":"SUMIFS(Tabella1[Interessi calcolatori annui, riconosciuti LAMal],Tabella1[Centro di costo*],$A19&\" - \"&$C19,Tabella1[Identificativo investimento*],\"<>X\")","v":0},1422,0,0,{"$f":"SUMIFS(Tabella1[Canone di locazione COAN-COIN],Tabella1[Centro di costo*],$A19&\" - \"&$C19,Tabella1[Identificativo investimento*],\"X\")","v":0}]
[]
["Totale CdC principali",null,null,{"$f":"SUM(D22:D30)","v":277000},{"$f":"SUM(E22:E30)","v":249000},178092.80303030307,0,26454.545454545456,0,138500,4649.6666666666661,0,31104.21212121212,0,0,{"$f":"SUM(P22:P30)","v":0}]
[{"$f":"'Codici COIN'!B54","v":100},{"$f":"'Codici COIN'!C54","v":220},{"$f":"'Codici COIN'!E54","v":"Servizio alberghiero"},{"$f":"SUMIFS(Tabella1[Valore iniziale totale d''investimento],Tabella1[Centro di costo*],$A22&\" - \"&$C22,Tabella1[Identificativo investimento*],\"<>X\")","v":160000},{"$f":"SUMIFS(Tabella1[Contributi dei Comuni (6900)],Tabella1[Centro di costo*],$A22&\" - \"&$C22,Tabella1[Identificativo investimento*],\"<>X\")+SUMIFS(Tabella1[Contributi dei Cantoni (6950)],Tabella1[Centro di costo*],$A22&\" - \"&$C22,Tabella1[Identificativo investimento*],\"<>X\")+SUMIFS(Tabella1[Contributi della Confederazione (6960)],Tabella1[Centro di costo*],$A22&\" - \"&$C22,Tabella1[Identificativo investimento*],\"<>X\")+SUMIFS(Tabella1[Utilizzo fondo 3 manutenzione e investimenti],Tabella1[Centro di costo*],$A22&\" - \"&$C22,Tabella1[Identificativo investimento*],\"<>X\")","v":160000},{"$f":"SUMIFS(Tabella1[Val. invest. al 31.12. dopo ammortamento],Tabella1[Centro di costo*],$A22&\" - \"&$C22,Tabella1[Identificativo investimento*],\"<>X\")","v":106875.00000000001},{"$f":"SUMIFS(Tabella1[Val. invest. LAMal dopo ammort. senza amm. eccess.],Tabella1[Centro di costo*],$A22&\" - \"&$C22,Tabella1[Identificativo investimento*],\"<>X\")","v":0},{"$f":"SUMIFS(Tabella1[Ammortamento calcolatorio annuo],Tabella1[Centro di costo*],$A22&\" - \"&$C22,Tabella1[Identificativo investimento*],\"<>X\")","v":15208.333333333334},{"$f":"SUMIFS(Tabella1[Ammortamento calcolatorio annuo, riconosciuto  LAMal],Tabella1[Centro di costo*],$A22&\" - \"&$C22,Tabella1[Identificativo investimento*],\"<>X\")","v":0},{"$f":"SUMIFS(Tabella1[Val. invest. per calcolo interessi],Tabella1[Centro di costo*],$A22&\" - \"&$C22,Tabella1[Identificativo investimento*],\"<>X\")","v":80000},{"$f":"SUMIFS(Tabella1[Interessi calcolatori annui],Tabella1[Centro di costo*],$A22&\" - \"&$C22,Tabella1[Identificativo investimento*],\"<>X\")","v":2651.6666666666665},{"$f":"SUMIFS(Tabella1[Interessi calcolatori annui, riconosciuti LAMal],Tabella1[Centro di costo*],$A22&\" - \"&$C22,Tabella1[Identificativo investimento*],\"<>X\")","v":0},{"$f":"H22+K22","v":17860},{"$f":"+I22+L22","v":0},{"$f":"IF(N22>0,+N22/M22,0)","v":0},{"$f":"SUMIFS(Tabella1[Canone di locazione COAN-COIN],Tabella1[Centro di costo*],$A22&\" - \"&$C22,Tabella1[Identificativo investimento*],\"X\")","v":0}]
[{"$f":"'Codici COIN'!B55","v":110},{"$f":"'Codici COIN'!C55","v":230},{"$f":"'Codici COIN'!E55","v":"Animazione (Assistenza non LAMal)"},{"$f":"SUMIFS(Tabella1[Valore iniziale totale d''investimento],Tabella1[Centro di costo*],$A23&\" - \"&$C23,Tabella1[Identificativo investimento*],\"<>X\")","v":70000},{"$f":"SUMIFS(Tabella1[Contributi dei Comuni (6900)],Tabella1[Centro di costo*],$A23&\" - \"&$C23,Tabella1[Identificativo investimento*],\"<>X\")+SUMIFS(Tabella1[Contributi dei Cantoni (6950)],Tabella1[Centro di costo*],$A23&\" - \"&$C23,Tabella1[Identificativo investimento*],\"<>X\")+SUMIFS(Tabella1[Contributi della Confederazione (6960)],Tabella1[Centro di costo*],$A23&\" - \"&$C23,Tabella1[Identificativo investimento*],\"<>X\")+SUMIFS(Tabella1[Utilizzo fondo 3 manutenzione e investimenti],Tabella1[Centro di costo*],$A23&\" - \"&$C23,Tabella1[Identificativo investimento*],\"<>X\")","v":42000},{"$f":"SUMIFS(Tabella1[Val. invest. al 31.12. dopo ammortamento],Tabella1[Centro di costo*],$A23&\" - \"&$C23,Tabella1[Identificativo investimento*],\"<>X\")","v":47196.969696969696},{"$f":"SUMIFS(Tabella1[Val. invest. LAMal dopo ammort. senza amm. eccess.],Tabella1[Centro di costo*],$A23&\" - \"&$C23,Tabella1[Identificativo investimento*],\"<>X\")","v":0},{"$f":"SUMIFS(Tabella1[Ammortamento calcolatorio annuo],Tabella1[Centro di costo*],$A23&\" - \"&$C23,Tabella1[Identificativo investimento*],\"<>X\")","v":2121.212121212121},{"$f":"SUMIFS(Tabella1[Ammortamento calcolatorio annuo, riconosciuto  LAMal],Tabella1[Centro di costo*],$A23&\" - \"&$C23,Tabella1[Identificativo investimento*],\"<>X\")","v":0},{"$f":"SUMIFS(Tabella1[Val. invest. per calcolo interessi],Tabella1[Centro di costo*],$A23&\" - \"&$C23,Tabella1[Identificativo investimento*],\"<>X\")","v":35000},{"$f":"SUMIFS(Tabella1[Interessi calcolatori annui],Tabella1[Centro di costo*],$A23&\" - \"&$C23,Tabella1[Identificativo investimento*],\"<>X\")","v":1295},{"$f":"SUMIFS(Tabella1[Interessi calcolatori annui, riconosciuti LAMal],Tabella1[Centro di costo*],$A23&\" - \"&$C23,Tabella1[Identificativo investimento*],\"<>X\")","v":0},3416.212121212121,0,{"$f":"IF(N23>0,+N23/M23,0)","v":0},{"$f":"SUMIFS(Tabella1[Canone di locazione COAN-COIN],Tabella1[Centro di costo*],$A23&\" - \"&$C23,Tabella1[Identificativo investimento*],\"X\")","v":0}]
[{"$f":"'Codici COIN'!B56","v":115},{"$f":"'Codici COIN'!C56","v":231},{"$f":"'Codici COIN'!E56","v":"Cure LAMal"},{"$f":"SUMIFS(Tabella1[Valore iniziale totale d''investimento],Tabella1[Centro di costo*],$A24&\" - \"&$C24,Tabella1[Identificativo investimento*],\"<>X\")","v":35000},{"$f":"SUMIFS(Tabella1[Contributi dei Comuni (6900)],Tabella1[Centro di costo*],$A24&\" - \"&$C24,Tabella1[Identificativo investimento*],\"<>X\")+SUMIFS(Tabella1[Contributi dei Cantoni (6950)],Tabella1[Centro di costo*],$A24&\" - \"&$C24,Tabella1[Identificativo investimento*],\"<>X\")+SUMIFS(Tabella1[Contributi della Confederazione (6960)],Tabella1[Centro di costo*],$A24&\" - \"&$C24,Tabella1[Identificativo investimento*],\"<>X\")+SUMIFS(Tabella1[Utilizzo fondo 3 manutenzione e investimenti],Tabella1[Centro di costo*],$A24&\" - \"&$C24,Tabella1[Identificativo investimento*],\"<>X\")","v":35000},{"$f":"SUMIFS(Tabella1[Val. invest. al 31.12. dopo ammortamento],Tabella1[Centro di costo*],$A24&\" - \"&$C24,Tabella1[Identificativo investimento*],\"<>X\")","v":12395.833333333332},{"$f":"SUMIFS(Tabella1[Val. invest. LAMal dopo ammort. senza amm. eccess.],Tabella1[Centro di costo*],$A24&\" - \"&$C24,Tabella1[Identificativo investimento*],\"<>X\")","v":0},{"$f":"SUMIFS(Tabella1[Ammortamento calcolatorio annuo],Tabella1[Centro di costo*],$A24&\" - \"&$C24,Tabella1[Identificativo investimento*],\"<>X\")","v":8750},{"$f":"SUMIFS(Tabella1[Ammortamento calcolatorio annuo, riconosciuto  LAMal],Tabella1[Centro di costo*],$A24&\" - \"&$C24,Tabella1[Identificativo investimento*],\"<>X\")","v":0},{"$f":"SUMIFS(Tabella1[Val. invest. per calcolo interessi],Tabella1[Centro di costo*],$A24&\" - \"&$C24,Tabella1[Identificativo investimento*],\"<>X\")","v":17500},{"$f":"SUMIFS(Tabella1[Interessi calcolatori annui],Tabella1[Centro di costo*],$A24&\" - \"&$C24,Tabella1[Identificativo investimento*],\"<>X\")","v":647.5},{"$f":"SUMIFS(Tabella1[Interessi calcolatori annui, riconosciuti LAMal],Tabella1[Centro di costo*],$A24&\" - \"&$C24,Tabella1[Identificativo investimento*],\"<>X\")","v":0},9397.5,0,0,{"$f":"SUMIFS(Tabella1[Canone di locazione COAN-COIN],Tabella1[Centro di costo*],$A24&\" - \"&$C24,Tabella1[Identificativo investimento*],\"X\")","v":0}]
[{"$f":"'Codici COIN'!B58","v":"130"},{"$f":"'Codici COIN'!C58","v":"(241a)"},{"$f":"'Codici COIN'!E58","v":"Fisioterapia"},{"$f":"SUMIFS(Tabella1[Valore iniziale totale d''investimento],Tabella1[Centro di costo*],$A25&\" - \"&$C25,Tabella1[Identificativo investimento*],\"<>X\")","v":12000},{"$f":"SUMIFS(Tabella1[Contributi dei Comuni (6900)],Tabella1[Centro di costo*],$A25&\" - \"&$C25,Tabella1[Identificativo investimento*],\"<>X\")+SUMIFS(Tabella1[Contributi dei Cantoni (6950)],Tabella1[Centro di costo*],$A25&\" - \"&$C25,Tabella1[Identificativo investimento*],\"<>X\")+SUMIFS(Tabella1[Contributi della Confederazione (6960)],Tabella1[Centro di costo*],$A25&\" - \"&$C25,Tabella1[Identificativo investimento*],\"<>X\")+SUMIFS(Tabella1[Utilizzo fondo 3 manutenzione e investimenti],Tabella1[Centro di costo*],$A25&\" - \"&$C25,Tabella1[Identificativo investimento*],\"<>X\")","v":12000},{"$f":"SUMIFS(Tabella1[Val. invest. al 31.12. dopo ammortamento],Tabella1[Centro di costo*],$A25&\" - \"&$C25,Tabella1[Identificativo investimento*],\"<>X\")","v":11625},{"$f":"SUMIFS(Tabella1[Val. invest. LAMal dopo ammort. senza amm. eccess.],Tabella1[Centro di costo*],$A25&\" - \"&$C25,Tabella1[Identificativo investimento*],\"<>X\")","v":0},{"$f":"SUMIFS(Tabella1[Ammortamento calcolatorio annuo],Tabella1[Centro di costo*],$A25&\" - \"&$C25,Tabella1[Identificativo investimento*],\"<>X\")","v":375},{"$f":"SUMIFS(Tabella1[Ammortamento calcolatorio annuo, riconosciuto  LAMal],Tabella1[Centro di costo*],$A25&\" - \"&$C25,Tabella1[Identificativo investimento*],\"<>X\")","v":0},{"$f":"SUMIFS(Tabella1[Val. invest. per calcolo interessi],Tabella1[Centro di costo*],$A25&\" - \"&$C25,Tabella1[Identificativo investimento*],\"<>X\")","v":6000},{"$f":"SUMIFS(Tabella1[Interessi calcolatori annui],Tabella1[Centro di costo*],$A25&\" - \"&$C25,Tabella1[Identificativo investimento*],\"<>X\")","v":55.5},{"$f":"SUMIFS(Tabella1[Interessi calcolatori annui, riconosciuti LAMal],Tabella1[Centro di costo*],$A25&\" - \"&$C25,Tabella1[Identificativo investimento*],\"<>X\")","v":0},430.5,0,0,{"$f":"SUMIFS(Tabella1[Canone di locazione COAN-COIN],Tabella1[Centro di costo*],$A25&\" - \"&$C25,Tabella1[Identificativo investimento*],\"X\")","v":0}]
[{"$f":"'Codici COIN'!B59","v":131},{"$f":"'Codici COIN'!C59","v":"(241b)"},{"$f":"'Codici COIN'!E59","v":"Ergoterapia"},{"$f":"SUMIFS(Tabella1[Valore iniziale totale d''investimento],Tabella1[Centro di costo*],$A26&\" - \"&$C26,Tabella1[Identificativo investimento*],\"<>X\")","v":0},{"$f":"SUMIFS(Tabella1[Contributi dei Comuni (6900)],Tabella1[Centro di costo*],$A26&\" - \"&$C26,Tabella1[Identificativo investimento*],\"<>X\")+SUMIFS(Tabella1[Contributi dei Cantoni (6950)],Tabella1[Centro di costo*],$A26&\" - \"&$C26,Tabella1[Identificativo investimento*],\"<>X\")+SUMIFS(Tabella1[Contributi della Confederazione (6960)],Tabella1[Centro di costo*],$A26&\" - \"&$C26,Tabella1[Identificativo investimento*],\"<>X\")+SUMIFS(Tabella1[Utilizzo fondo 3 manutenzione e investimenti],Tabella1[Centro di costo*],$A26&\" - \"&$C26,Tabella1[Identificativo investimento*],\"<>X\")","v":0},{"$f":"SUMIFS(Tabella1[Val. invest. al 31.12. dopo ammortamento],Tabella1[Centro di costo*],$A26&\" - \"&$C26,Tabella1[Identificativo investimento*],\"<>X\")","v":0},{"$f":"SUMIFS(Tabella1[Val. invest. LAMal dopo ammort. senza amm. eccess.],Tabella1[Centro di costo*],$A26&\" - \"&$C26,Tabella1[Identificativo investimento*],\"<>X\")","v":0},{"$f":"SUMIFS(Tabella1[Ammortamento calcolatorio annuo],Tabella1[Centro di costo*],$A26&\" - \"&$C26,Tabella1[Identificativo investimento*],\"<>X\")","v":0},{"$f":"SUMIFS(Tabella1[Ammortamento calcolatorio annuo, riconosciuto  LAMal],Tabella1[Centro di costo*],$A26&\" - \"&$C26,Tabella1[Identificativo investimento*],\"<>X\")","v":0},{"$f":"SUMIFS(Tabella1[Val. invest. per calcolo interessi],Tabella1[Centro di costo*],$A26&\" - \"&$C26,Tabella1[Identificativo investimento*],\"<>X\")","v":0},{"$f":"SUMIFS(Tabella1[Interessi calcolatori annui],Tabella1[Centro di costo*],$A26&\" - \"&$C26,Tabella1[Identificativo investimento*],\"<>X\")","v":0},{"$f":"SUMIFS(Tabella1[Interessi calcolatori annui, riconosciuti LAMal],Tabella1[Centro di costo*],$A26&\" - \"&$C26,Tabella1[Identificativo investimento*],\"<>X\")","v":0},0,0,0,{"$f":"SUMIFS(Tabella1[Canone di locazione COAN-COIN],Tabella1[Centro di costo*],$A26&\" - \"&$C26,Tabella1[Identificativo investimento*],\"X\")","v":0}]
[{"$f":"'Codici COIN'!B60","v":132},{"$f":"'Codici COIN'!C60","v":"(241c)"},{"$f":"'Codici COIN'!E60","v":"Altre consulenze e terapie"},{"$f":"SUMIFS(Tabella1[Valore iniziale totale d''investimento],Tabella1[Centro di costo*],$A27&\" - \"&$C27,Tabella1[Identificativo investimento*],\"<>X\")","v":0},{"$f":"SUMIFS(Tabella1[Contributi dei Comuni (6900)],Tabella1[Centro di costo*],$A27&\" - \"&$C27,Tabella1[Identificativo investimento*],\"<>X\")+SUMIFS(Tabella1[Contributi dei Cantoni (6950)],Tabella1[Centro di costo*],$A27&\" - \"&$C27,Tabella1[Identificativo investimento*],\"<>X\")+SUMIFS(Tabella1[Contributi della Confederazione (6960)],Tabella1[Centro di costo*],$A27&\" - \"&$C27,Tabella1[Identificativo investimento*],\"<>X\")+SUMIFS(Tabella1[Utilizzo fondo 3 manutenzione e investimenti],Tabella1[Centro di costo*],$A27&\" - \"&$C27,Tabella1[Identificativo investimento*],\"<>X\")","v":0},{"$f":"SUMIFS(Tabella1[Val. invest. al 31.12. dopo ammortamento],Tabella1[Centro di costo*],$A27&\" - \"&$C27,Tabella1[Identificativo investimento*],\"<>X\")","v":0},{"$f":"SUMIFS(Tabella1[Val. invest. LAMal dopo ammort. senza amm. eccess.],Tabella1[Centro di costo*],$A27&\" - \"&$C27,Tabella1[Identificativo investimento*],\"<>X\")","v":0},{"$f":"SUMIFS(Tabella1[Ammortamento calcolatorio annuo],Tabella1[Centro di costo*],$A27&\" - \"&$C27,Tabella1[Identificativo investimento*],\"<>X\")","v":0},{"$f":"SUMIFS(Tabella1[Ammortamento calcolatorio annuo, riconosciuto  LAMal],Tabella1[Centro di costo*],$A27&\" - \"&$C27,Tabella1[Identificativo investimento*],\"<>X\")","v":0},{"$f":"SUMIFS(Tabella1[Val. invest. per calcolo interessi],Tabella1[Centro di costo*],$A27&\" - \"&$C27,Tabella1[Identificativo investimento*],\"<>X\")","v":0},{"$f":"SUMIFS(Tabella1[Interessi calcolatori annui],Tabella1[Centro di costo*],$A27&\" - \"&$C27,Tabella1[Identificativo investimento*],\"<>X\")","v":0},{"$f":"SUMIFS(Tabella1[Interessi calcolatori annui, riconosciuti LAMal],Tabella1[Centro di costo*],$A27&\" - \"&$C27,Tabella1[Identificativo investimento*],\"<>X\")","v":0},0,0,0,{"$f":"SUMIFS(Tabella1[Canone di locazione COAN-COIN],Tabella1[Centro di costo*],$A27&\" - \"&$C27,Tabella1[Identificativo investimento*],\"X\")","v":0}]
[{"$f":"'Codici COIN'!B61","v":140},{"$f":"'Codici COIN'!C61","v":240},{"$f":"'Codici COIN'!E61","v":"Servizio medico"},{"$f":"SUMIFS(Tabella1[Valore iniziale totale d''investimento],Tabella1[Centro di costo*],$A28&\" - \"&$C28,Tabella1[Identificativo investimento*],\"<>X\")","v":0},{"$f":"SUMIFS(Tabella1[Contributi dei Comuni (6900)],Tabella1[Centro di costo*],$A28&\" - \"&$C28,Tabella1[Identificativo investimento*],\"<>X\")+SUMIFS(Tabella1[Contributi dei Cantoni (6950)],Tabella1[Centro di costo*],$A28&\" - \"&$C28,Tabella1[Identificativo investimento*],\"<>X\")+SUMIFS(Tabella1[Contributi della Confederazione (6960)],Tabella1[Centro di costo*],$A28&\" - \"&$C28,Tabella1[Identificativo investimento*],\"<>X\")+SUMIFS(Tabella1[Utilizzo fondo 3 manutenzione e investimenti],Tabella1[Centro di costo*],$A28&\" - \"&$C28,Tabella1[Identificativo investimento*],\"<>X\")","v":0},{"$f":"SUMIFS(Tabella1[Val. invest. al 31.12. dopo ammortamento],Tabella1[Centro di costo*],$A28&\" - \"&$C28,Tabella1[Identificativo investimento*],\"<>X\")","v":0},{"$f":"SUMIFS(Tabella1[Val. invest. LAMal dopo ammort. senza amm. eccess.],Tabella1[Centro di costo*],$A28&\" - \"&$C28,Tabella1[Identificativo investimento*],\"<>X\")","v":0},{"$f":"SUMIFS(Tabella1[Ammortamento calcolatorio annuo],Tabella1[Centro di costo*],$A28&\" - \"&$C28,Tabella1[Identificativo investimento*],\"<>X\")","v":0},{"$f":"SUMIFS(Tabella1[Ammortamento calcolatorio annuo, riconosciuto  LAMal],Tabella1[Centro di costo*],$A28&\" - \"&$C28,Tabella1[Identificativo investimento*],\"<>X\")","v":0},{"$f":"SUMIFS(Tabella1[Val. invest. per calcolo interessi],Tabella1[Centro di costo*],$A28&\" - \"&$C28,Tabella1[Identificativo investimento*],\"<>X\")","v":0},{"$f":"SUMIFS(Tabella1[Interessi calcolatori annui],Tabella1[Centro di costo*],$A28&\" - \"&$C28,Tabella1[Identificativo investimento*],\"<>X\")","v":0},{"$f":"SUMIFS(Tabella1[Interessi calcolatori annui, riconosciuti LAMal],Tabella1[Centro di costo*],$A28&\" - \"&$C28,Tabella1[Identificativo investimento*],\"<>X\")","v":0},0,0,0,{"$f":"SUMIFS(Tabella1[Canone di locazione COAN-COIN],Tabella1[Centro di costo*],$A28&\" - \"&$C28,Tabella1[Identificativo investimento*],\"X\")","v":0}]
[{"$f":"'Codici COIN'!B62","v":150},{"$f":"'Codici COIN'!C62","v":250},{"$f":"'Codici COIN'!E62","v":"Materiale EMAp"},{"$f":"SUMIFS(Tabella1[Valore iniziale totale d''investimento],Tabella1[Centro di costo*],$A29&\" - \"&$C29,Tabella1[Identificativo investimento*],\"<>X\")","v":0},{"$f":"SUMIFS(Tabella1[Contributi dei Comuni (6900)],Tabella1[Centro di costo*],$A29&\" - \"&$C29,Tabella1[Identificativo investimento*],\"<>X\")+SUMIFS(Tabella1[Contributi dei Cantoni (6950)],Tabella1[Centro di costo*],$A29&\" - \"&$C29,Tabella1[Identificativo investimento*],\"<>X\")+SUMIFS(Tabella1[Contributi della Confederazione (6960)],Tabella1[Centro di costo*],$A29&\" - \"&$C29,Tabella1[Identificativo investimento*],\"<>X\")+SUMIFS(Tabella1[Utilizzo fondo 3 manutenzione e investimenti],Tabella1[Centro di costo*],$A29&\" - \"&$C29,Tabella1[Identificativo investimento*],\"<>X\")","v":0},{"$f":"SUMIFS(Tabella1[Val. invest. al 31.12. dopo ammortamento],Tabella1[Centro di costo*],$A29&\" - \"&$C29,Tabella1[Identificativo investimento*],\"<>X\")","v":0},{"$f":"SUMIFS(Tabella1[Val. invest. LAMal dopo ammort. senza amm. eccess.],Tabella1[Centro di costo*],$A29&\" - \"&$C29,Tabella1[Identificativo investimento*],\"<>X\")","v":0},{"$f":"SUMIFS(Tabella1[Ammortamento calcolatorio annuo],Tabella1[Centro di costo*],$A29&\" - \"&$C29,Tabella1[Identificativo investimento*],\"<>X\")","v":0},{"$f":"SUMIFS(Tabella1[Ammortamento calcolatorio annuo, riconosciuto  LAMal],Tabella1[Centro di costo*],$A29&\" - \"&$C29,Tabella1[Identificativo investimento*],\"<>X\")","v":0},{"$f":"SUMIFS(Tabella1[Val. invest. per calcolo interessi],Tabella1[Centro di costo*],$A29&\" - \"&$C29,Tabella1[Identificativo investimento*],\"<>X\")","v":0},{"$f":"SUMIFS(Tabella1[Interessi calcolatori annui],Tabella1[Centro di costo*],$A29&\" - \"&$C29,Tabella1[Identificativo investimento*],\"<>X\")","v":0},{"$f":"SUMIFS(Tabella1[Interessi calcolatori annui, riconosciuti LAMal],Tabella1[Centro di costo*],$A29&\" - \"&$C29,Tabella1[Identificativo investimento*],\"<>X\")","v":0},0,0,0,{"$f":"SUMIFS(Tabella1[Canone di locazione COAN-COIN],Tabella1[Centro di costo*],$A29&\" - \"&$C29,Tabella1[Identificativo investimento*],\"X\")","v":0}]
[{"$f":"'Codici COIN'!B63","v":151},{"$f":"'Codici COIN'!C63","v":251},{"$f":"'Codici COIN'!E63","v":"Medicamenti ES/EMT"},{"$f":"SUMIFS(Tabella1[Valore iniziale totale d''investimento],Tabella1[Centro di costo*],$A30&\" - \"&$C30,Tabella1[Identificativo investimento*],\"<>X\")","v":0},{"$f":"SUMIFS(Tabella1[Contributi dei Comuni (6900)],Tabella1[Centro di costo*],$A30&\" - \"&$C30,Tabella1[Identificativo investimento*],\"<>X\")+SUMIFS(Tabella1[Contributi dei Cantoni (6950)],Tabella1[Centro di costo*],$A30&\" - \"&$C30,Tabella1[Identificativo investimento*],\"<>X\")+SUMIFS(Tabella1[Contributi della Confederazione (6960)],Tabella1[Centro di costo*],$A30&\" - \"&$C30,Tabella1[Identificativo investimento*],\"<>X\")+SUMIFS(Tabella1[Utilizzo fondo 3 manutenzione e investimenti],Tabella1[Centro di costo*],$A30&\" - \"&$C30,Tabella1[Identificativo investimento*],\"<>X\")","v":0},{"$f":"SUMIFS(Tabella1[Val. invest. al 31.12. dopo ammortamento],Tabella1[Centro di costo*],$A30&\" - \"&$C30,Tabella1[Identificativo investimento*],\"<>X\")","v":0},{"$f":"SUMIFS(Tabella1[Val. invest. LAMal dopo ammort. senza amm. eccess.],Tabella1[Centro di costo*],$A30&\" - \"&$C30,Tabella1[Identificativo investimento*],\"<>X\")","v":0},{"$f":"SUMIFS(Tabella1[Ammortamento calcolatorio annuo],Tabella1[Centro di costo*],$A30&\" - \"&$C30,Tabella1[Identificativo investimento*],\"<>X\")","v":0},{"$f":"SUMIFS(Tabella1[Ammortamento calcolatorio annuo, riconosciuto  LAMal],Tabella1[Centro di costo*],$A30&\" - \"&$C30,Tabella1[Identificativo investimento*],\"<>X\")","v":0},{"$f":"SUMIFS(Tabella1[Val. invest. per calcolo interessi],Tabella1[Centro di costo*],$A30&\" - \"&$C30,Tabella1[Identificativo investimento*],\"<>X\")","v":0},{"$f":"SUMIFS(Tabella1[Interessi calcolatori annui],Tabella1[Centro di costo*],$A30&\" - \"&$C30,Tabella1[Identificativo investimento*],\"<>X\")","v":0},{"$f":"SUMIFS(Tabella1[Interessi calcolatori annui, riconosciuti LAMal],Tabella1[Centro di costo*],$A30&\" - \"&$C30,Tabella1[Identificativo investimento*],\"<>X\")","v":0},0,0,0,{"$f":"SUMIFS(Tabella1[Canone di locazione COAN-COIN],Tabella1[Centro di costo*],$A30&\" - \"&$C30,Tabella1[Identificativo investimento*],\"X\")","v":0}]
[]
["Totale CdC Servizi annessi",null,null,{"$f":"SUM(D33:D41)","v":1500000},{"$f":"SUM(E33:E41)","v":1500000},{"$f":"SUM(F33:F41)","v":1181818.1818181819},0,45454.545454545449,0,750000,27750,0,73204.545454545441,0,{"$f":"IF(N32>0,+N32/M32,0)","v":0},{"$f":"SUM(P33:P41)","v":0}]
[{"$f":"'Codici COIN'!B65","v":160},{"$f":"'Codici COIN'!C65","v":160},{"$f":"'Codici COIN'!E65","v":"Cure acute transitorie (CAT)"},{"$f":"SUMIFS(Tabella1[Valore iniziale totale d''investimento],Tabella1[Centro di costo*],$A33&\" - \"&$C33,Tabella1[Identificativo investimento*],\"<>X\")","v":1500000},{"$f":"SUMIFS(Tabella1[Contributi dei Comuni (6900)],Tabella1[Centro di costo*],$A33&\" - \"&$C33,Tabella1[Identificativo investimento*],\"<>X\")+SUMIFS(Tabella1[Contributi dei Cantoni (6950)],Tabella1[Centro di costo*],$A33&\" - \"&$C33,Tabella1[Identificativo investimento*],\"<>X\")+SUMIFS(Tabella1[Contributi della Confederazione (6960)],Tabella1[Centro di costo*],$A33&\" - \"&$C33,Tabella1[Identificativo investimento*],\"<>X\")+SUMIFS(Tabella1[Utilizzo fondo 3 manutenzione e investimenti],Tabella1[Centro di costo*],$A33&\" - \"&$C33,Tabella1[Identificativo investimento*],\"<>X\")","v":1500000},{"$f":"SUMIFS(Tabella1[Val. invest. al 31.12. dopo ammortamento],Tabella1[Centro di costo*],$A33&\" - \"&$C33,Tabella1[Identificativo investimento*],\"<>X\")","v":1181818.1818181819},{"$f":"SUMIFS(Tabella1[Val. invest. LAMal dopo ammort. senza amm. eccess.],Tabella1[Centro di costo*],$A33&\" - \"&$C33,Tabella1[Identificativo investimento*],\"<>X\")","v":0},{"$f":"SUMIFS(Tabella1[Ammortamento calcolatorio annuo],Tabella1[Centro di costo*],$A33&\" - \"&$C33,Tabella1[Identificativo investimento*],\"<>X\")","v":45454.545454545449},{"$f":"SUMIFS(Tabella1[Ammortamento calcolatorio annuo, riconosciuto  LAMal],Tabella1[Centro di costo*],$A33&\" - \"&$C33,Tabella1[Identificativo investimento*],\"<>X\")","v":0},{"$f":"SUMIFS(Tabella1[Val. invest. per calcolo interessi],Tabella1[Centro di costo*],$A33&\" - \"&$C33,Tabella1[Identificativo investimento*],\"<>X\")","v":750000},{"$f":"SUMIFS(Tabella1[Interessi calcolatori annui],Tabella1[Centro di costo*],$A33&\" - \"&$C33,Tabella1[Identificativo investimento*],\"<>X\")","v":27750},{"$f":"SUMIFS(Tabella1[Interessi calcolatori annui, riconosciuti LAMal],Tabella1[Centro di costo*],$A33&\" - \"&$C33,Tabella1[Identificativo investimento*],\"<>X\")","v":0},{"$f":"H33+K33","v":73204.545454545441},{"$f":"+I33+L33","v":0},{"$f":"IF(N33>0,+N33/M33,0)","v":0},{"$f":"SUMIFS(Tabella1[Canone di locazione COAN-COIN],Tabella1[Centro di costo*],$A33&\" - \"&$C33,Tabella1[Identificativo investimento*],\"X\")","v":0}]
[{"$f":"'Codici COIN'!B66","v":161},{"$f":"'Codici COIN'!C66","v":161},{"$f":"'Codici COIN'!E66","v":"Soggiorni terapeutici temporanei (STT)"},{"$f":"SUMIFS(Tabella1[Valore iniziale totale d''investimento],Tabella1[Centro di costo*],$A34&\" - \"&$C34,Tabella1[Identificativo investimento*],\"<>X\")","v":0},{"$f":"SUMIFS(Tabella1[Contributi dei Comuni (6900)],Tabella1[Centro di costo*],$A34&\" - \"&$C34,Tabella1[Identificativo investimento*],\"<>X\")+SUMIFS(Tabella1[Contributi dei Cantoni (6950)],Tabella1[Centro di costo*],$A34&\" - \"&$C34,Tabella1[Identificativo investimento*],\"<>X\")+SUMIFS(Tabella1[Contributi della Confederazione (6960)],Tabella1[Centro di costo*],$A34&\" - \"&$C34,Tabella1[Identificativo investimento*],\"<>X\")+SUMIFS(Tabella1[Utilizzo fondo 3 manutenzione e investimenti],Tabella1[Centro di costo*],$A34&\" - \"&$C34,Tabella1[Identificativo investimento*],\"<>X\")","v":0},{"$f":"SUMIFS(Tabella1[Val. invest. al 31.12. dopo ammortamento],Tabella1[Centro di costo*],$A34&\" - \"&$C34,Tabella1[Identificativo investimento*],\"<>X\")","v":0},{"$f":"SUMIFS(Tabella1[Val. invest. LAMal dopo ammort. senza amm. eccess.],Tabella1[Centro di costo*],$A34&\" - \"&$C34,Tabella1[Identificativo investimento*],\"<>X\")","v":0},{"$f":"SUMIFS(Tabella1[Ammortamento calcolatorio annuo],Tabella1[Centro di costo*],$A34&\" - \"&$C34,Tabella1[Identificativo investimento*],\"<>X\")","v":0},{"$f":"SUMIFS(Tabella1[Ammortamento calcolatorio annuo, riconosciuto  LAMal],Tabella1[Centro di costo*],$A34&\" - \"&$C34,Tabella1[Identificativo investimento*],\"<>X\")","v":0},{"$f":"SUMIFS(Tabella1[Val. invest. per calcolo interessi],Tabella1[Centro di costo*],$A34&\" - \"&$C34,Tabella1[Identificativo investimento*],\"<>X\")","v":0},{"$f":"SUMIFS(Tabella1[Interessi calcolatori annui],Tabella1[Centro di costo*],$A34&\" - \"&$C34,Tabella1[Identificativo investimento*],\"<>X\")","v":0},{"$f":"SUMIFS(Tabella1[Interessi calcolatori annui, riconosciuti LAMal],Tabella1[Centro di costo*],$A34&\" - \"&$C34,Tabella1[Identificativo investimento*],\"<>X\")","v":0},0,0,{"$f":"IF(N34>0,+N34/M34,0)","v":0},{"$f":"SUMIFS(Tabella1[Canone di locazione COAN-COIN],Tabella1[Centro di costo*],$A34&\" - \"&$C34,Tabella1[Identificativo investimento*],\"X\")","v":0}]
[{"$f":"'Codici COIN'!B67","v":162},{"$f":"'Codici COIN'!C67","v":162},{"$f":"'Codici COIN'!E67","v":"Cure palliative"},{"$f":"SUMIFS(Tabella1[Valore iniziale totale d''investimento],Tabella1[Centro di costo*],$A35&\" - \"&$C35,Tabella1[Identificativo investimento*],\"<>X\")","v":0},{"$f":"SUMIFS(Tabella1[Contributi dei Comuni (6900)],Tabella1[Centro di costo*],$A35&\" - \"&$C35,Tabella1[Identificativo investimento*],\"<>X\")+SUMIFS(Tabella1[Contributi dei Cantoni (6950)],Tabella1[Centro di costo*],$A35&\" - \"&$C35,Tabella1[Identificativo investimento*],\"<>X\")+SUMIFS(Tabella1[Contributi della Confederazione (6960)],Tabella1[Centro di costo*],$A35&\" - \"&$C35,Tabella1[Identificativo investimento*],\"<>X\")+SUMIFS(Tabella1[Utilizzo fondo 3 manutenzione e investimenti],Tabella1[Centro di costo*],$A35&\" - \"&$C35,Tabella1[Identificativo investimento*],\"<>X\")","v":0},{"$f":"SUMIFS(Tabella1[Val. invest. al 31.12. dopo ammortamento],Tabella1[Centro di costo*],$A35&\" - \"&$C35,Tabella1[Identificativo investimento*],\"<>X\")","v":0},{"$f":"SUMIFS(Tabella1[Val. invest. LAMal dopo ammort. senza amm. eccess.],Tabella1[Centro di costo*],$A35&\" - \"&$C35,Tabella1[Identificativo investimento*],\"<>X\")","v":0},{"$f":"SUMIFS(Tabella1[Ammortamento calcolatorio annuo],Tabella1[Centro di costo*],$A35&\" - \"&$C35,Tabella1[Identificativo investimento*],\"<>X\")","v":0},{"$f":"SUMIFS(Tabella1[Ammortamento calcolatorio annuo, riconosciuto  LAMal],Tabella1[Centro di costo*],$A35&\" - \"&$C35,Tabella1[Identificativo investimento*],\"<>X\")","v":0},{"$f":"SUMIFS(Tabella1[Val. invest. per calcolo interessi],Tabella1[Centro di costo*],$A35&\" - \"&$C35,Tabella1[Identificativo investimento*],\"<>X\")","v":0},{"$f":"SUMIFS(Tabella1[Interessi calcolatori annui],Tabella1[Centro di costo*],$A35&\" - \"&$C35,Tabella1[Identificativo investimento*],\"<>X\")","v":0},{"$f":"SUMIFS(Tabella1[Interessi calcolatori annui, riconosciuti LAMal],Tabella1[Centro di costo*],$A35&\" - \"&$C35,Tabella1[Identificativo investimento*],\"<>X\")","v":0},0,0,0,{"$f":"SUMIFS(Tabella1[Canone di locazione COAN-COIN],Tabella1[Centro di costo*],$A35&\" - \"&$C35,Tabella1[Identificativo investimento*],\"X\")","v":0}]
[{"$f":"'Codici COIN'!B68","v":163},{"$f":"'Codici COIN'!C68","v":163},{"$f":"'Codici COIN'!E68","v":"Reparto Alzheimer"},{"$f":"SUMIFS(Tabella1[Valore iniziale totale d''investimento],Tabella1[Centro di costo*],$A36&\" - \"&$C36,Tabella1[Identificativo investimento*],\"<>X\")","v":0},{"$f":"SUMIFS(Tabella1[Contributi dei Comuni (6900)],Tabella1[Centro di costo*],$A36&\" - \"&$C36,Tabella1[Identificativo investimento*],\"<>X\")+SUMIFS(Tabella1[Contributi dei Cantoni (6950)],Tabella1[Centro di costo*],$A36&\" - \"&$C36,Tabella1[Identificativo investimento*],\"<>X\")+SUMIFS(Tabella1[Contributi della Confederazione (6960)],Tabella1[Centro di costo*],$A36&\" - \"&$C36,Tabella1[Identificativo investimento*],\"<>X\")+SUMIFS(Tabella1[Utilizzo fondo 3 manutenzione e investimenti],Tabella1[Centro di costo*],$A36&\" - \"&$C36,Tabella1[Identificativo investimento*],\"<>X\")","v":0},{"$f":"SUMIFS(Tabella1[Val. invest. al 31.12. dopo ammortamento],Tabella1[Centro di costo*],$A36&\" - \"&$C36,Tabella1[Identificativo investimento*],\"<>X\")","v":0},{"$f":"SUMIFS(Tabella1[Val. invest. LAMal dopo ammort. senza amm. eccess.],Tabella1[Centro di costo*],$A36&\" - \"&$C36,Tabella1[Identificativo investimento*],\"<>X\")","v":0},{"$f":"SUMIFS(Tabella1[Ammortamento calcolatorio annuo],Tabella1[Centro di costo*],$A36&\" - \"&$C36,Tabella1[Identificativo investimento*],\"<>X\")","v":0},{"$f":"SUMIFS(Tabella1[Ammortamento calcolatorio annuo, riconosciuto  LAMal],Tabella1[Centro di costo*],$A36&\" - \"&$C36,Tabella1[Identificativo investimento*],\"<>X\")","v":0},{"$f":"SUMIFS(Tabella1[Val. invest. per calcolo interessi],Tabella1[Centro di costo*],$A36&\" - \"&$C36,Tabella1[Identificativo investimento*],\"<>X\")","v":0},{"$f":"SUMIFS(Tabella1[Interessi calcolatori annui],Tabella1[Centro di costo*],$A36&\" - \"&$C36,Tabella1[Identificativo investimento*],\"<>X\")","v":0},{"$f":"SUMIFS(Tabella1[Interessi calcolatori annui, riconosciuti LAMal],Tabella1[Centro di costo*],$A36&\" - \"&$C36,Tabella1[Identificativo investimento*],\"<>X\")","v":0},0,0,0,{"$f":"SUMIFS(Tabella1[Canone di locazione COAN-COIN],Tabella1[Centro di costo*],$A36&\" - \"&$C36,Tabella1[Identificativo investimento*],\"X\")","v":0}]
[{"$f":"'Codici COIN'!B69","v":"16X"},{"$f":"'Codici COIN'!C69","v":"16X"},{"$f":"'Codici COIN'!E69","v":"Stazionario n"},{"$f":"SUMIFS(Tabella1[Valore iniziale totale d''investimento],Tabella1[Centro di costo*],$A37&\" - \"&$C37,Tabella1[Identificativo investimento*],\"<>X\")","v":0},{"$f":"SUMIFS(Tabella1[Contributi dei Comuni (6900)],Tabella1[Centro di costo*],$A37&\" - \"&$C37,Tabella1[Identificativo investimento*],\"<>X\")+SUMIFS(Tabella1[Contributi dei Cantoni (6950)],Tabella1[Centro di costo*],$A37&\" - \"&$C37,Tabella1[Identificativo investimento*],\"<>X\")+SUMIFS(Tabella1[Contributi della Confederazione (6960)],Tabella1[Centro di costo*],$A37&\" - \"&$C37,Tabella1[Identificativo investimento*],\"<>X\")+SUMIFS(Tabella1[Utilizzo fondo 3 manutenzione e investimenti],Tabella1[Centro di costo*],$A37&\" - \"&$C37,Tabella1[Identificativo investimento*],\"<>X\")","v":0},{"$f":"SUMIFS(Tabella1[Val. invest. al 31.12. dopo ammortamento],Tabella1[Centro di costo*],$A37&\" - \"&$C37,Tabella1[Identificativo investimento*],\"<>X\")","v":0},{"$f":"SUMIFS(Tabella1[Val. invest. LAMal dopo ammort. senza amm. eccess.],Tabella1[Centro di costo*],$A37&\" - \"&$C37,Tabella1[Identificativo investimento*],\"<>X\")","v":0},{"$f":"SUMIFS(Tabella1[Ammortamento calcolatorio annuo],Tabella1[Centro di costo*],$A37&\" - \"&$C37,Tabella1[Identificativo investimento*],\"<>X\")","v":0},{"$f":"SUMIFS(Tabella1[Ammortamento calcolatorio annuo, riconosciuto  LAMal],Tabella1[Centro di costo*],$A37&\" - \"&$C37,Tabella1[Identificativo investimento*],\"<>X\")","v":0},{"$f":"SUMIFS(Tabella1[Val. invest. per calcolo interessi],Tabella1[Centro di costo*],$A37&\" - \"&$C37,Tabella1[Identificativo investimento*],\"<>X\")","v":0},{"$f":"SUMIFS(Tabella1[Interessi calcolatori annui],Tabella1[Centro di costo*],$A37&\" - \"&$C37,Tabella1[Identificativo investimento*],\"<>X\")","v":0},{"$f":"SUMIFS(Tabella1[Interessi calcolatori annui, riconosciuti LAMal],Tabella1[Centro di costo*],$A37&\" - \"&$C37,Tabella1[Identificativo investimento*],\"<>X\")","v":0},0,0,0,{"$f":"SUMIFS(Tabella1[Canone di locazione COAN-COIN],Tabella1[Centro di costo*],$A37&\" - \"&$C37,Tabella1[Identificativo investimento*],\"X\")","v":0}]
[{"$f":"'Codici COIN'!B70","v":170},{"$f":"'Codici COIN'!C70","v":"(n/a)"},{"$f":"'Codici COIN'!E70","v":"Ambulatorio medico"},{"$f":"SUMIFS(Tabella1[Valore iniziale totale d''investimento],Tabella1[Centro di costo*],$A38&\" - \"&$C38,Tabella1[Identificativo investimento*],\"<>X\")","v":0},{"$f":"SUMIFS(Tabella1[Contributi dei Comuni (6900)],Tabella1[Centro di costo*],$A38&\" - \"&$C38,Tabella1[Identificativo investimento*],\"<>X\")+SUMIFS(Tabella1[Contributi dei Cantoni (6950)],Tabella1[Centro di costo*],$A38&\" - \"&$C38,Tabella1[Identificativo investimento*],\"<>X\")+SUMIFS(Tabella1[Contributi della Confederazione (6960)],Tabella1[Centro di costo*],$A38&\" - \"&$C38,Tabella1[Identificativo investimento*],\"<>X\")+SUMIFS(Tabella1[Utilizzo fondo 3 manutenzione e investimenti],Tabella1[Centro di costo*],$A38&\" - \"&$C38,Tabella1[Identificativo investimento*],\"<>X\")","v":0},{"$f":"SUMIFS(Tabella1[Val. invest. al 31.12. dopo ammortamento],Tabella1[Centro di costo*],$A38&\" - \"&$C38,Tabella1[Identificativo investimento*],\"<>X\")","v":0},{"$f":"SUMIFS(Tabella1[Val. invest. LAMal dopo ammort. senza amm. eccess.],Tabella1[Centro di costo*],$A38&\" - \"&$C38,Tabella1[Identificativo investimento*],\"<>X\")","v":0},{"$f":"SUMIFS(Tabella1[Ammortamento calcolatorio annuo],Tabella1[Centro di costo*],$A38&\" - \"&$C38,Tabella1[Identificativo investimento*],\"<>X\")","v":0},{"$f":"SUMIFS(Tabella1[Ammortamento calcolatorio annuo, riconosciuto  LAMal],Tabella1[Centro di costo*],$A38&\" - \"&$C38,Tabella1[Identificativo investimento*],\"<>X\")","v":0},{"$f":"SUMIFS(Tabella1[Val. invest. per calcolo interessi],Tabella1[Centro di costo*],$A38&\" - \"&$C38,Tabella1[Identificativo investimento*],\"<>X\")","v":0},{"$f":"SUMIFS(Tabella1[Interessi calcolatori annui],Tabella1[Centro di costo*],$A38&\" - \"&$C38,Tabella1[Identificativo investimento*],\"<>X\")","v":0},{"$f":"SUMIFS(Tabella1[Interessi calcolatori annui, riconosciuti LAMal],Tabella1[Centro di costo*],$A38&\" - \"&$C38,Tabella1[Identificativo investimento*],\"<>X\")","v":0},0,0,0,{"$f":"SUMIFS(Tabella1[Canone di locazione COAN-COIN],Tabella1[Centro di costo*],$A38&\" - \"&$C38,Tabella1[Identificativo investimento*],\"X\")","v":0}]
[{"$f":"'Codici COIN'!B71","v":171},{"$f":"'Codici COIN'!C71","v":171},{"$f":"'Codici COIN'!E71","v":"Centro diurno terapeutico (CDT)"},{"$f":"SUMIFS(Tabella1[Valore iniziale totale d''investimento],Tabella1[Centro di costo*],$A39&\" - \"&$C39,Tabella1[Identificativo investimento*],\"<>X\")","v":0},{"$f":"SUMIFS(Tabella1[Contributi dei Comuni (6900)],Tabella1[Centro di costo*],$A39&\" - \"&$C39,Tabella1[Identificativo investimento*],\"<>X\")+SUMIFS(Tabella1[Contributi dei Cantoni (6950)],Tabella1[Centro di costo*],$A39&\" - \"&$C39,Tabella1[Identificativo investimento*],\"<>X\")+SUMIFS(Tabella1[Contributi della Confederazione (6960)],Tabella1[Centro di costo*],$A39&\" - \"&$C39,Tabella1[Identificativo investimento*],\"<>X\")+SUMIFS(Tabella1[Utilizzo fondo 3 manutenzione e investimenti],Tabella1[Centro di costo*],$A39&\" - \"&$C39,Tabella1[Identificativo investimento*],\"<>X\")","v":0},{"$f":"SUMIFS(Tabella1[Val. invest. al 31.12. dopo ammortamento],Tabella1[Centro di costo*],$A39&\" - \"&$C39,Tabella1[Identificativo investimento*],\"<>X\")","v":0},{"$f":"SUMIFS(Tabella1[Val. invest. LAMal dopo ammort. senza amm. eccess.],Tabella1[Centro di costo*],$A39&\" - \"&$C39,Tabella1[Identificativo investimento*],\"<>X\")","v":0},{"$f":"SUMIFS(Tabella1[Ammortamento calcolatorio annuo],Tabella1[Centro di costo*],$A39&\" - \"&$C39,Tabella1[Identificativo investimento*],\"<>X\")","v":0},{"$f":"SUMIFS(Tabella1[Ammortamento calcolatorio annuo, riconosciuto  LAMal],Tabella1[Centro di costo*],$A39&\" - \"&$C39,Tabella1[Identificativo investimento*],\"<>X\")","v":0},{"$f":"SUMIFS(Tabella1[Val. invest. per calcolo interessi],Tabella1[Centro di costo*],$A39&\" - \"&$C39,Tabella1[Identificativo investimento*],\"<>X\")","v":0},{"$f":"SUMIFS(Tabella1[Interessi calcolatori annui],Tabella1[Centro di costo*],$A39&\" - \"&$C39,Tabella1[Identificativo investimento*],\"<>X\")","v":0},{"$f":"SUMIFS(Tabella1[Interessi calcolatori annui, riconosciuti LAMal],Tabella1[Centro di costo*],$A39&\" - \"&$C39,Tabella1[Identificativo investimento*],\"<>X\")","v":0},{"$f":"H39+K39","v":0},0,0,{"$f":"SUMIFS(Tabella1[Canone di locazione COAN-COIN],Tabella1[Centro di costo*],$A39&\" - \"&$C39,Tabella1[Identificativo investimento*],\"X\")","v":0}]
[{"$f":"'Codici COIN'!B72","v":172},{"$f":"'Codici COIN'!C72","v":"(n/a)"},{"$f":"'Codici COIN'!E72","v":"Appartamenti protetti"},{"$f":"SUMIFS(Tabella1[Valore iniziale totale d''investimento],Tabella1[Centro di costo*],$A40&\" - \"&$C40,Tabella1[Identificativo investimento*],\"<>X\")","v":0},{"$f":"SUMIFS(Tabella1[Contributi dei Comuni (6900)],Tabella1[Centro di costo*],$A40&\" - \"&$C40,Tabella1[Identificativo investimento*],\"<>X\")+SUMIFS(Tabella1[Contributi dei Cantoni (6950)],Tabella1[Centro di costo*],$A40&\" - \"&$C40,Tabella1[Identificativo investimento*],\"<>X\")+SUMIFS(Tabella1[Contributi della Confederazione (6960)],Tabella1[Centro di costo*],$A40&\" - \"&$C40,Tabella1[Identificativo investimento*],\"<>X\")+SUMIFS(Tabella1[Utilizzo fondo 3 manutenzione e investimenti],Tabella1[Centro di costo*],$A40&\" - \"&$C40,Tabella1[Identificativo investimento*],\"<>X\")","v":0},{"$f":"SUMIFS(Tabella1[Val. invest. al 31.12. dopo ammortamento],Tabella1[Centro di costo*],$A40&\" - \"&$C40,Tabella1[Identificativo investimento*],\"<>X\")","v":0},{"$f":"SUMIFS(Tabella1[Val. invest. LAMal dopo ammort. senza amm. eccess.],Tabella1[Centro di costo*],$A40&\" - \"&$C40,Tabella1[Identificativo investimento*],\"<>X\")","v":0},{"$f":"SUMIFS(Tabella1[Ammortamento calcolatorio annuo],Tabella1[Centro di costo*],$A40&\" - \"&$C40,Tabella1[Identificativo investimento*],\"<>X\")","v":0},{"$f":"SUMIFS(Tabella1[Ammortamento calcolatorio annuo, riconosciuto  LAMal],Tabella1[Centro di costo*],$A40&\" - \"&$C40,Tabella1[Identificativo investimento*],\"<>X\")","v":0},{"$f":"SUMIFS(Tabella1[Val. invest. per calcolo interessi],Tabella1[Centro di costo*],$A40&\" - \"&$C40,Tabella1[Identificativo investimento*],\"<>X\")","v":0},{"$f":"SUMIFS(Tabella1[Interessi calcolatori annui],Tabella1[Centro di costo*],$A40&\" - \"&$C40,Tabella1[Identificativo investimento*],\"<>X\")","v":0},{"$f":"SUMIFS(Tabella1[Interessi calcolatori annui, riconosciuti LAMal],Tabella1[Centro di costo*],$A40&\" - \"&$C40,Tabella1[Identificativo investimento*],\"<>X\")","v":0},0,0,0,{"$f":"SUMIFS(Tabella1[Canone di locazione COAN-COIN],Tabella1[Centro di costo*],$A40&\" - \"&$C40,Tabella1[Identificativo investimento*],\"X\")","v":0}]
[{"$f":"'Codici COIN'!B73","v":"17X"},{"$f":"'Codici COIN'!C73","v":"(n/a)"},{"$f":"'Codici COIN'!E73","v":"Ambulatorio n (es. CD socio-assistenziale)"},{"$f":"SUMIFS(Tabella1[Valore iniziale totale d''investimento],Tabella1[Centro di costo*],A41&\" - \"&C41,Tabella1[Identificativo investimento*],\"<>X\")","v":0},{"$f":"SUMIF(Tabella1[Centro di costo*],A41&\" - \"&C41,Tabella1[Contributi dei Comuni (6900)])+SUMIF(Tabella1[Centro di costo*],A41&\" - \"&C41,Tabella1[Contributi dei Cantoni (6950)])+SUMIF(Tabella1[Centro di costo*],A41&\" - \"&C41,Tabella1[Contributi della Confederazione (6960)])+SUMIF(Tabella1[Centro di costo*],A41&\" - \"&C41,Tabella1[Utilizzo fondo 3 manutenzione e investimenti])","v":0},{"$f":"SUMIFS(Tabella1[Val. invest. al 31.12. dopo ammortamento],Tabella1[Centro di costo*],$A41&\" - \"&$C41,Tabella1[Identificativo investimento*],\"<>X\")","v":0},{"$f":"SUMIFS(Tabella1[Val. invest. LAMal dopo ammort. senza amm. eccess.],Tabella1[Centro di costo*],$A41&\" - \"&$C41,Tabella1[Identificativo investimento*],\"<>X\")","v":0},{"$f":"SUMIFS(Tabella1[Ammortamento calcolatorio annuo],Tabella1[Centro di costo*],$A41&\" - \"&$C41,Tabella1[Identificativo investimento*],\"<>X\")","v":0},{"$f":"SUMIFS(Tabella1[Ammortamento calcolatorio annuo, riconosciuto  LAMal],Tabella1[Centro di costo*],$A41&\" - \"&$C41,Tabella1[Identificativo investimento*],\"<>X\")","v":0},{"$f":"SUMIFS(Tabella1[Val. invest. per calcolo interessi],Tabella1[Centro di costo*],$A41&\" - \"&$C41,Tabella1[Identificativo investimento*],\"<>X\")","v":0},{"$f":"SUMIFS(Tabella1[Interessi calcolatori annui],Tabella1[Centro di costo*],$A41&\" - \"&$C41,Tabella1[Identificativo investimento*],\"<>X\")","v":0},{"$f":"SUMIFS(Tabella1[Interessi calcolatori annui, riconosciuti LAMal],Tabella1[Centro di costo*],$A41&\" - \"&$C41,Tabella1[Identificativo investimento*],\"<>X\")","v":0},0,0,0,{"$f":"SUMIFS(Tabella1[Canone di locazione COAN-COIN],Tabella1[Centro di costo*],$A41&\" - \"&$C41,Tabella1[Identificativo investimento*],\"X\")","v":0}]
[]
["Totale CdC Gestione estranea",null,null,{"$f":"D44","v":0},0,0,0,0,0,0,0,0,0,0,{"$f":"IF(N43>0,+N43/M43,0)","v":0},{"$f":"SUM(P44)","v":0}]
[{"$f":"'Codici COIN'!B75","v":"9XX"},{"$f":"'Codici COIN'!C75","v":"(n/a)"},{"$f":"'Codici COIN'!E75","v":"Gestione estranea"},{"$f":"SUMIFS(Tabella1[Valore iniziale totale d''investimento],Tabella1[Centro di costo*],$A44&\" - \"&$C44,Tabella1[Identificativo investimento*],\"<>X\")","v":0},{"$f":"SUMIFS(Tabella1[Contributi dei Comuni (6900)],Tabella1[Centro di costo*],$A44&\" - \"&$C44,Tabella1[Identificativo investimento*],\"<>X\")+SUMIFS(Tabella1[Contributi dei Cantoni (6950)],Tabella1[Centro di costo*],$A44&\" - \"&$C44,Tabella1[Identificativo investimento*],\"<>X\")+SUMIFS(Tabella1[Contributi della Confederazione (6960)],Tabella1[Centro di costo*],$A44&\" - \"&$C44,Tabella1[Identificativo investimento*],\"<>X\")+SUMIFS(Tabella1[Utilizzo fondo 3 manutenzione e investimenti],Tabella1[Centro di costo*],$A44&\" - \"&$C44,Tabella1[Identificativo investimento*],\"<>X\")","v":0},{"$f":"SUMIFS(Tabella1[Val. invest. al 31.12. dopo ammortamento],Tabella1[Centro di costo*],$A44&\" - \"&$C44,Tabella1[Identificativo investimento*],\"<>X\")","v":0},{"$f":"SUMIFS(Tabella1[Val. invest. LAMal dopo ammort. senza amm. eccess.],Tabella1[Centro di costo*],$A44&\" - \"&$C44,Tabella1[Identificativo investimento*],\"<>X\")","v":0},{"$f":"SUMIFS(Tabella1[Ammortamento calcolatorio annuo],Tabella1[Centro di costo*],$A44&\" - \"&$C44,Tabella1[Identificativo investimento*],\"<>X\")","v":0},{"$f":"SUMIFS(Tabella1[Ammortamento calcolatorio annuo, riconosciuto  LAMal],Tabella1[Centro di costo*],$A44&\" - \"&$C44,Tabella1[Identificativo investimento*],\"<>X\")","v":0},{"$f":"SUMIFS(Tabella1[Val. invest. per calcolo interessi],Tabella1[Centro di costo*],$A44&\" - \"&$C44,Tabella1[Identificativo investimento*],\"<>X\")","v":0},{"$f":"SUMIFS(Tabella1[Interessi calcolatori annui],Tabella1[Centro di costo*],$A44&\" - \"&$C44,Tabella1[Identificativo investimento*],\"<>X\")","v":0},{"$f":"SUMIFS(Tabella1[Interessi calcolatori annui, riconosciuti LAMal],Tabella1[Centro di costo*],$A44&\" - \"&$C44,Tabella1[Identificativo investimento*],\"<>X\")","v":0},{"$f":"H44+K44","v":0},{"$f":"+I44+L44","v":0},{"$f":"IF(N44>0,+N44/M44,0)","v":0},{"$f":"SUMIFS(Tabella1[Canone di locazione COAN-COIN],Tabella1[Centro di costo*],$A44&\" - \"&$C44,Tabella1[Identificativo investimento*],\"X\")","v":0}]
[]
[]
["Totale (investimenti per i centri di costo UACD)",null,null,{"$f":"SUM(D8,D21,D32,D43)","v":27265500},16767500,12818225.757575758,0,755922.72727272718,0,15657750,578861.91666666663,0,1334784.6439393938,0,{"$f":"IF(N47>0,+N47/M47,0)","v":0},{"$f":"SUM(P8,P21,P32,P43)","v":1000}]
[]
[]
[]
["Tabella di confronto dei costi annuali di utilizzo per UACD (da COIN e da COAN)"]
[{"$f":"Parametri!$B$7","v":2021},null,{"$f":"Parametri!$B$3","v":"ESEMPIO - CPA STANDARD CON CAT-STT"}]
[]
[null,null,null,"Costi annuali di utilizzo da COIN",null,null,"Costi annuali di utilizzo da COAN",null,null,"Differenza",null,null,"Canoni di locazione"]
["CdC COAN \nTI 2021","CdC SOMED 2021","Denominazione del CdC\n","Ammortamenti","Interessi calcolatori ","Totale","Ammortamenti\n(442)","Interessi calcolatori\n(448)","Totale","Ammortamenti","Interessi calcolatori ","Totale","COIN","COAN"]
[]
["Totale CdC generali",null,null,{"$f":"H8","v":684013.63636363635},{"$f":"K8","v":546462.25},{"$f":"M8","v":1230475.8863636362},{"$f":"SUM(G58:G68)","v":0},{"$f":"SUM(H58:H68)","v":0},{"$f":"G57+H57","v":0},{"$f":"D57-G57","v":684013.63636363635},{"$f":"E57-H57","v":546462.25},{"$f":"F57-I57","v":1230475.8863636362},{"$f":"P8","v":1000},{"$f":"SUM(N58:N68)","v":1000}]
[{"$f":"'Codici COIN'!B42","v":"010"},{"$f":"'Codici COIN'!C42","v":"010"},{"$f":"'Codici COIN'!E42","v":"Edifici"},{"$f":"H9","v":636363.63636363635},{"$f":"K9","v":538350},{"$f":"M9","v":1174713.6363636362},{"$f":"'Contabilità per CDC - UACD'!$F$31","v":0},{"$f":"'Contabilità per CDC - UACD'!$F$34","v":0},{"$f":"G58+H58","v":0},636363.63636363635,{"$f":"E58-H58","v":538350},1174713.6363636362,{"$f":"P9","v":0},{"$f":"'Contabilità per CDC - UACD'!F33","v":0}]
[{"$f":"'Codici COIN'!B43","v":"011"},{"$f":"'Codici COIN'!C43","v":"015"},{"$f":"'Codici COIN'!E43","v":"Energia"},{"$f":"H10","v":4500},{"$f":"K10","v":1665},6165,{"$f":"'Contabilità per CDC - UACD'!$G$31","v":0},{"$f":"'Contabilità per CDC - UACD'!$G$34","v":0},0,4500,1665,6165,{"$f":"P10","v":0},{"$f":"'Contabilità per CDC - UACD'!G33","v":0}]
[{"$f":"'Codici COIN'!B44","v":"020"},{"$f":"'Codici COIN'!C44","v":"020"},{"$f":"'Codici COIN'!E44","v":"Servizio tecnico"},6000,2220,8220,{"$f":"'Contabilità per CDC - UACD'!$H$31","v":0},{"$f":"'Contabilità per CDC - UACD'!$H$34","v":0},0,6000,2220,8220,0,{"$f":"'Contabilità per CDC - UACD'!H33","v":0}]
[{"$f":"'Codici COIN'!B45","v":"021"},{"$f":"'Codici COIN'!C45","v":"021"},{"$f":"'Codici COIN'!E45","v":"Servizio trasporti"},8000,740,8740,{"$f":"'Contabilità per CDC - UACD'!$I$31","v":0},{"$f":"'Contabilità per CDC - UACD'!$I$34","v":0},0,8000,740,8740,0,{"$f":"'Contabilità per CDC - UACD'!I33","v":0}]
[{"$f":"'Codici COIN'!B46","v":"030"},{"$f":"'Codici COIN'!C46","v":"030"},{"$f":"'Codici COIN'!E46","v":"Direzione e amministrazione"},19750,1850,21600,{"$f":"'Contabilità per CDC - UACD'!$J$31","v":0},{"$f":"'Contabilità per CDC - UACD'!$J$34","v":0},0,19750,1850,21600,1000,{"$f":"'Contabilità per CDC - UACD'!J33","v":1000}]
[{"$f":"'Codici COIN'!B47","v":"040"},{"$f":"'Codici COIN'!C47","v":"040"},{"$f":"'Codici COIN'!E47","v":"Economia domestica in generale"},0,0,0,{"$f":"'Contabilità per CDC - UACD'!$K$31","v":0},{"$f":"'Contabilità per CDC - UACD'!$K$34","v":0},0,0,0,0,0,{"$f":"'Contabilità per CDC - UACD'!K33","v":0}]
[{"$f":"'Codici COIN'!B48","v":"041"},{"$f":"'Codici COIN'!C48","v":"041"},{"$f":"'Codici COIN'!E48","v":"Lavanderia"},3300,610.5,3910.5,{"$f":"'Contabilità per CDC - UACD'!$L$31","v":0},{"$f":"'Contabilità per CDC - UACD'!$L$34","v":0},0,3300,610.5,3910.5,0,{"$f":"'Contabilità per CDC - UACD'!L33","v":0}]
[{"$f":"'Codici COIN'!B49","v":"042"},{"$f":"'Codici COIN'!C49","v":"042"},{"$f":"'Codici COIN'!E49","v":"Pulizia"},1100,101.75,1201.75,{"$f":"'Contabilità per CDC - UACD'!$M$31","v":0},{"$f":"'Contabilità per CDC - UACD'!$M$34","v":0},0,1100,101.75,1201.75,0,{"$f":"'Contabilità per CDC - UACD'!M33","v":0}]
[{"$f":"'Codici COIN'!B50","v":"060"},{"$f":"'Codici COIN'!C50","v":"060"},{"$f":"'Codici COIN'!E50","v":"Cucina"},3800,703,4503,{"$f":"'Contabilità per CDC - UACD'!$N$31","v":0},{"$f":"'Contabilità per CDC - UACD'!$N$34","v":0},0,3800,703,4503,0,{"$f":"'Contabilità per CDC - UACD'!N33","v":0}]
[{"$f":"'Codici COIN'!B51","v":"090"},{"$f":"'Codici COIN'!C51","v":"090"},{"$f":"'Codici COIN'!E51","v":"Magazzino centrale"},0,0,0,{"$f":"'Contabilità per CDC - UACD'!$O$31","v":0},{"$f":"'Contabilità per CDC - UACD'!$O$34","v":0},0,0,0,0,0,{"$f":"'Contabilità per CDC - UACD'!O33","v":0}]
[{"$f":"'Codici COIN'!B52","v":"095"},{"$f":"'Codici COIN'!C52","v":"095"},{"$f":"'Codici COIN'!E52","v":"Farmacia"},1200,222,1422,{"$f":"'Contabilità per CDC - UACD'!$P$31","v":0},{"$f":"'Contabilità per CDC - UACD'!$P$34","v":0},0,1200,222,1422,0,{"$f":"'Contabilità per CDC - UACD'!P33","v":0}]
[]
["Totale CdC principali",null,null,26454.545454545456,4649.6666666666661,31104.21212121212,{"$f":"SUM(G71:G79)","v":0},{"$f":"SUM(H71:H79)","v":0},{"$f":"G70+H70","v":0},{"$f":"D70-G70","v":26454.545454545456},{"$f":"E70-H70","v":4649.6666666666661},{"$f":"F70-I70","v":31104.21212121212},{"$f":"P21","v":0},{"$f":"SUM(N71:N79)","v":0}]
[{"$f":"'Codici COIN'!B54","v":100},{"$f":"'Codici COIN'!C54","v":220},{"$f":"'Codici COIN'!E54","v":"Servizio alberghiero"},15208.333333333334,2651.6666666666665,17860,{"$f":"'Contabilità per CDC - UACD'!$R$31","v":0},{"$f":"'Contabilità per CDC - UACD'!$R$34","v":0},0,15208.333333333334,2651.6666666666665,17860,{"$f":"P22","v":0},{"$f":"'Contabilità per CDC - UACD'!R33","v":0}]
[{"$f":"'Codici COIN'!B55","v":110},{"$f":"'Codici COIN'!C55","v":230},{"$f":"'Codici COIN'!E55","v":"Animazione (Assistenza non LAMal)"},2121.212121212121,1295,3416.212121212121,{"$f":"'Contabilità per CDC - UACD'!$S$31","v":0},{"$f":"'Contabilità per CDC - UACD'!$S$34","v":0},0,2121.212121212121,1295,3416.212121212121,{"$f":"P23","v":0},{"$f":"'Contabilità per CDC - UACD'!S33","v":0}]
[{"$f":"'Codici COIN'!B56","v":115},{"$f":"'Codici COIN'!C56","v":231},{"$f":"'Codici COIN'!E56","v":"Cure LAMal"},8750,647.5,9397.5,{"$f":"'Contabilità per CDC - UACD'!$T$31","v":0},{"$f":"'Contabilità per CDC - UACD'!$T$34","v":0},0,8750,647.5,9397.5,0,{"$f":"'Contabilità per CDC - UACD'!T33","v":0}]
[{"$f":"'Codici COIN'!B58","v":"130"},{"$f":"'Codici COIN'!C58","v":"(241a)"},{"$f":"'Codici COIN'!E58","v":"Fisioterapia"},375,55.5,430.5,{"$f":"'Contabilità per CDC - UACD'!$U$31","v":0},{"$f":"'Contabilità per CDC - UACD'!$U$34","v":0},0,375,55.5,430.5,0,{"$f":"'Contabilità per CDC - UACD'!U33","v":0}]
[{"$f":"'Codici COIN'!B59","v":131},{"$f":"'Codici COIN'!C59","v":"(241b)"},{"$f":"'Codici COIN'!E59","v":"Ergoterapia"},0,0,0,{"$f":"'Contabilità per CDC - UACD'!$V$31","v":0},{"$f":"'Contabilità per CDC - UACD'!$V$34","v":0},0,0,0,0,0,{"$f":"'Contabilità per CDC - UACD'!V33","v":0}]
[{"$f":"'Codici COIN'!B60","v":132},{"$f":"'Codici COIN'!C60","v":"(241c)"},{"$f":"'Codici COIN'!E60","v":"Altre consulenze e terapie"},0,0,0,{"$f":"'Contabilità per CDC - UACD'!$W$31","v":0},{"$f":"'Contabilità per CDC - UACD'!$W$34","v":0},0,0,0,0,0,{"$f":"'Contabilità per CDC - UACD'!W33","v":0}]
[{"$f":"'Codici COIN'!B61","v":140},{"$f":"'Codici COIN'!C61","v":240},{"$f":"'Codici COIN'!E61","v":"Servizio medico"},0,0,0,{"$f":"'Contabilità per CDC - UACD'!$X$31","v":0},{"$f":"'Contabilità per CDC - UACD'!$X$34","v":0},0,0,0,0,0,{"$f":"'Contabilità per CDC - UACD'!X33","v":0}]
[{"$f":"'Codici COIN'!B62","v":150},{"$f":"'Codici COIN'!C62","v":250},{"$f":"'Codici COIN'!E62","v":"Materiale EMAp"},0,0,0,{"$f":"'Contabilità per CDC - UACD'!$Y$31","v":0},{"$f":"'Contabilità per CDC - UACD'!$Y$34","v":0},0,0,0,0,0,{"$f":"'Contabilità per CDC - UACD'!Y33","v":0}]
[{"$f":"'Codici COIN'!B63","v":151},{"$f":"'Codici COIN'!C63","v":251},{"$f":"'Codici COIN'!E63","v":"Medicamenti ES/EMT"},0,0,0,{"$f":"'Contabilità per CDC - UACD'!$Z$31","v":0},{"$f":"'Contabilità per CDC - UACD'!$Z$34","v":0},0,0,0,0,0,{"$f":"'Contabilità per CDC - UACD'!Z33","v":0}]
[]
["Totale CdC Servizi annessi",null,null,45454.545454545449,27750,73204.545454545441,{"$f":"SUM(G82:G90)","v":0},{"$f":"SUM(H82:H90)","v":0},{"$f":"G81+H81","v":0},{"$f":"D81-G81","v":45454.545454545449},{"$f":"E81-H81","v":27750},{"$f":"F81-I81","v":73204.545454545441},{"$f":"P32","v":0},{"$f":"SUM(N82:N90)","v":0}]
[{"$f":"'Codici COIN'!B65","v":160},{"$f":"'Codici COIN'!C65","v":160},{"$f":"'Codici COIN'!E65","v":"Cure acute transitorie (CAT)"},45454.545454545449,27750,73204.545454545441,{"$f":"'Contabilità per CDC - UACD'!$AB$31","v":0},{"$f":"'Contabilità per CDC - UACD'!$AB$34","v":0},0,45454.545454545449,27750,73204.545454545441,{"$f":"P33","v":0},{"$f":"'Contabilità per CDC - UACD'!AB33","v":0}]
[{"$f":"'Codici COIN'!B66","v":161},{"$f":"'Codici COIN'!C66","v":161},{"$f":"'Codici COIN'!E66","v":"Soggiorni terapeutici temporanei (STT)"},0,0,0,{"$f":"'Contabilità per CDC - UACD'!$AC$31","v":0},{"$f":"'Contabilità per CDC - UACD'!$AC$34","v":0},0,0,0,0,{"$f":"P34","v":0},{"$f":"'Contabilità per CDC - UACD'!AC33","v":0}]
[{"$f":"'Codici COIN'!B67","v":162},{"$f":"'Codici COIN'!C67","v":162},{"$f":"'Codici COIN'!E67","v":"Cure palliative"},0,0,0,{"$f":"'Contabilità per CDC - UACD'!$AD$31","v":0},{"$f":"'Contabilità per CDC - UACD'!$AD$34","v":0},0,0,0,0,0,{"$f":"'Contabilità per CDC - UACD'!AD33","v":0}]
[{"$f":"'Codici COIN'!B68","v":163},{"$f":"'Codici COIN'!C68","v":163},{"$f":"'Codici COIN'!E68","v":"Reparto Alzheimer"},0,0,0,{"$f":"'Contabilità per CDC - UACD'!$AE$31","v":0},{"$f":"'Contabilità per CDC - UACD'!$AE$34","v":0},0,0,0,0,0,{"$f":"'Contabilità per CDC - UACD'!AE33","v":0}]
[{"$f":"'Codici COIN'!B69","v":"16X"},{"$f":"'Codici COIN'!C69","v":"16X"},{"$f":"'Codici COIN'!E69","v":"Stazionario n"},0,0,0,{"$f":"'Contabilità per CDC - UACD'!$AF$31","v":0},{"$f":"'Contabilità per CDC - UACD'!$AF$34","v":0},0,0,0,0,0,{"$f":"'Contabilità per CDC - UACD'!AF33","v":0}]
[{"$f":"'Codici COIN'!B70","v":170},{"$f":"'Codici COIN'!C70","v":"(n/a)"},{"$f":"'Codici COIN'!E70","v":"Ambulatorio medico"},0,0,0,{"$f":"'Contabilità per CDC - UACD'!$AG$31","v":0},{"$f":"'Contabilità per CDC - UACD'!$AG$34","v":0},0,0,0,0,0,{"$f":"'Contabilità per CDC - UACD'!AG33","v":0}]
[{"$f":"'Codici COIN'!B71","v":171},{"$f":"'Codici COIN'!C71","v":171},{"$f":"'Codici COIN'!E71","v":"Centro diurno terapeutico (CDT)"},0,0,0,{"$f":"'Contabilità per CDC - UACD'!$AH$31","v":0},{"$f":"'Contabilità per CDC - UACD'!$AH$34","v":0},0,0,0,0,0,{"$f":"'Contabilità per CDC - UACD'!AH33","v":0}]
[{"$f":"'Codici COIN'!B72","v":172},{"$f":"'Codici COIN'!C72","v":"(n/a)"},{"$f":"'Codici COIN'!E72","v":"Appartamenti protetti"},0,0,0,{"$f":"'Contabilità per CDC - UACD'!$AI$31","v":0},{"$f":"'Contabilità per CDC - UACD'!$AI$34","v":0},0,0,0,0,0,{"$f":"'Contabilità per CDC - UACD'!AI33","v":0}]
[{"$f":"'Codici COIN'!B73","v":"17X"},{"$f":"'Codici COIN'!C73","v":"(n/a)"},{"$f":"'Codici COIN'!E73","v":"Ambulatorio n (es. CD socio-assistenziale)"},0,0,0,{"$f":"'Contabilità per CDC - UACD'!$AJ$31","v":0},{"$f":"'Contabilità per CDC - UACD'!$AJ$34","v":0},0,0,0,0,0,{"$f":"'Contabilità per CDC - UACD'!AJ33","v":0}]
[]
["Totale CdC Gestione estranea",null,null,0,0,0,{"$f":"N43","v":0},{"$f":"O43","v":0},{"$f":"P43","v":0},{"$f":"D92-G92","v":0},0,0,{"$f":"P43","v":0},{"$f":"SUM(N93)","v":0}]
[{"$f":"'Codici COIN'!B75","v":"9XX"},{"$f":"'Codici COIN'!C75","v":"(n/a)"},{"$f":"'Codici COIN'!E75","v":"Gestione estranea"},0,0,0,{"$f":"'Contabilità per CDC - UACD'!$BF$31","v":0},{"$f":"'Contabilità per CDC - UACD'!$BF$34","v":0},{"$f":"G93+H93","v":0},0,0,0,{"$f":"P44","v":0},{"$f":"SUM('Contabilità per CDC - UACD'!AV33:'Contabilità per CDC - UACD'!BE33)","v":0}]
[]
[]
["Totale ",null,null,755922.72727272718,578861.91666666663,1334784.6439393938,{"$f":"G57+G70+G81+G92","v":0},{"$f":"H57+H70+H81+H92","v":0},{"$f":"I57+I70+I81+I92","v":0},{"$f":"D96-G96","v":755922.72727272718},{"$f":"E96-H96","v":578861.91666666663},{"$f":"F96-I96","v":1334784.6439393938},{"$f":"P47","v":1000},{"$f":"N57+N70+N81+N92","v":1000}]
[]
[]
[]
["Resoconto contabilità investimenti per SOMED (in CHF)"]
[{"$f":"Parametri!$B$7","v":2021},null,{"$f":"Parametri!$B$3","v":"ESEMPIO - CPA STANDARD CON CAT-STT"}]
[]
[]
[null,null,null,"Valore immobilizzazioni",null,"Valore dopo ammortamento",null,"Costi annuali di utilizzo delle immobilizzazioni "]
[null,null,null,"Totale ","Contributi","al 31.12 ","di cui","Ammortamenti calcolatori",null,"Interessi calcolatori (sul valore medio)",null,null,"Totale costi annuali di utilizzo "]
["CdC COAN \nTI 2021","CdC SOMED 2021","Denominazione del CdC\n","Valore \niniziale","d'investimento\n(alla data iniziale)",null,"riconosciuti LAMal","Ammortamenti totale","di cui riconosciuti LAMal","Valore investimento per calcolo interessi","Interessi calcolatori totali","di cui riconosciuti LAMal","Totale costi","di cui riconosciuti LAMal ","(in %)"]
[]
["Totale CdC generali",null,null,{"$f":"SUM(D109:D119)","v":27068500},16518500,12653467,0,796135,0,15559250,575446,0,{"$f":"SUM(M109:M119)","v":1371581},{"$f":"SUM(N109:N119)","v":0},{"$f":"IF(N108>0,+N108/M108,0)","v":0}]
[{"$f":"'Codici COIN'!B42","v":"010"},{"$f":"'Codici COIN'!C42","v":"010"},{"$f":"'Codici COIN'!E42&\" + CdC Servizi annessi SOMED\"","v":"Edifici + CdC Servizi annessi SOMED"},{"$f":"ROUND(SUMIF(Tabella1[Centro di costo*],$A9&\" - \"&$C9,Tabella1[Valore iniziale totale d''investimento])+SUMIF(Tabella1[Centro di costo*],$A33&\" - \"&$C33,Tabella1[Valore iniziale totale d''investimento])+SUMIF(Tabella1[Centro di costo*],$A34&\" - \"&$C34,Tabella1[Valore iniziale totale d''investimento])+SUMIF(Tabella1[Centro di costo*],$A35&\" - \"&$C35,Tabella1[Valore iniziale totale d''investimento])+SUMIF(Tabella1[Centro di costo*],$A36&\" - \"&$C36,Tabella1[Valore iniziale totale d''investimento])+SUMIF(Tabella1[Centro di costo*],$A37&\" - \"&$C37,Tabella1[Valore iniziale totale d''investimento])+SUMIF(Tabella1[Centro di costo*],$A39&\" - \"&$C39,Tabella1[Valore iniziale totale d''investimento]),0)","v":26550000},{"$f":"ROUND(SUMIF(Tabella1[Centro di costo*],$A9&\" - \"&$C9,Tabella1[Contributi dei Comuni (6900)])+SUMIF(Tabella1[Centro di costo*],$A9&\" - \"&$C9,Tabella1[Contributi dei Cantoni (6950)])+SUMIF(Tabella1[Centro di costo*],$A9&\" - \"&$C9,Tabella1[Contributi della Confederazione (6960)])+SUMIF(Tabella1[Centro di costo*],$A9&\" - \"&$C9,Tabella1[Utilizzo fondo 3 manutenzione e investimenti])+SUMIF(Tabella1[Centro di costo*],$A33&\" - \"&$C33,Tabella1[Contributi dei Comuni (6900)])+SUMIF(Tabella1[Centro di costo*],$A33&\" - \"&$C33,Tabella1[Contributi dei Cantoni (6950)])+SUMIF(Tabella1[Centro di costo*],$A33&\" - \"&$C33,Tabella1[Contributi della Confederazione (6960)])+SUMIF(Tabella1[Centro di costo*],$A33&\" - \"&$C33,Tabella1[Utilizzo fondo 3 manutenzione e investimenti])+SUMIF(Tabella1[Centro di costo*],$A34&\" - \"&$C34,Tabella1[Contributi dei Comuni (6900)])+SUMIF(Tabella1[Centro di costo*],$A34&\" - \"&$C34,Tabella1[Contributi dei Cantoni (6950)])+SUMIF(Tabella1[Centro di costo*],$A34&\" - \"&$C34,Tabella1[Contributi della Confederazione (6960)])+SUMIF(Tabella1[Centro di costo*],$A34&\" - \"&$C34,Tabella1[Utilizzo fondo 3 manutenzione e investimenti])+SUMIF(Tabella1[Centro di costo*],$A35&\" - \"&$C35,Tabella1[Contributi dei Comuni (6900)])+SUMIF(Tabella1[Centro di costo*],$A35&\" - \"&$C35,Tabella1[Contributi dei Cantoni (6950)])+SUMIF(Tabella1[Centro di costo*],$A35&\" - \"&$C35,Tabella1[Contributi della Confederazione (6960)])+SUMIF(Tabella1[Centro di costo*],$A35&\" - \"&$C35,Tabella1[Utilizzo fondo 3 manutenzione e investimenti])+SUMIF(Tabella1[Centro di costo*],$A36&\" - \"&$C36,Tabella1[Contributi dei Comuni (6900)])+SUMIF(Tabella1[Centro di costo*],$A36&\" - \"&$C36,Tabella1[Contributi dei Cantoni (6950)])+SUMIF(Tabella1[Centro di costo*],$A36&\" - \"&$C36,Tabella1[Contributi della Confederazione (6960)])+SUMIF(Tabella1[Centro di costo*],$A36&\" - \"&$C36,Tabella1[Utilizzo fondo 3 manutenzione e investimenti])+SUMIF(Tabella1[Centro di costo*],$A37&\" - \"&$C37,Tabella1[Contributi dei Comuni (6900)])+SUMIF(Tabella1[Centro di costo*],$A37&\" - \"&$C37,Tabella1[Contributi dei Cantoni (6950)])+SUMIF(Tabella1[Centro di costo*],$A37&\" - \"&$C37,Tabella1[Contributi della Confederazione (6960)])+SUMIF(Tabella1[Centro di costo*],$A37&\" - \"&$C37,Tabella1[Utilizzo fondo 3 manutenzione e investimenti])+SUMIF(Tabella1[Centro di costo*],$A39&\" - \"&$C39,Tabella1[Contributi dei Comuni (6900)])+SUMIF(Tabella1[Centro di costo*],$A39&\" - \"&$C39,Tabella1[Contributi dei Cantoni (6950)])+SUMIF(Tabella1[Centro di costo*],$A39&\" - \"&$C39,Tabella1[Contributi della Confederazione (6960)])+SUMIF(Tabella1[Centro di costo*],$A39&\" - \"&$C39,Tabella1[Utilizzo fondo 3 manutenzione e investimenti]),0)","v":16100000},{"$f":"ROUND(SUMIF(Tabella1[Centro di costo*],$A9&\" - \"&$C9,Tabella1[Val. invest. al 31.12. dopo ammortamento])+SUMIF(Tabella1[Centro di costo*],$A33&\" - \"&$C33,Tabella1[Val. invest. al 31.12. dopo ammortamento])+SUMIF(Tabella1[Centro di costo*],$A34&\" - \"&$C34,Tabella1[Val. invest. al 31.12. dopo ammortamento])+SUMIF(Tabella1[Centro di costo*],$A35&\" - \"&$C35,Tabella1[Val. invest. al 31.12. dopo ammortamento])+SUMIF(Tabella1[Centro di costo*],$A36&\" - \"&$C36,Tabella1[Val. invest. al 31.12. dopo ammortamento])+SUMIF(Tabella1[Centro di costo*],$A37&\" - \"&$C37,Tabella1[Val. invest. al 31.12. dopo ammortamento])+SUMIF(Tabella1[Centro di costo*],$A39&\" - \"&$C39,Tabella1[Val. invest. al 31.12. dopo ammortamento]),0)","v":12421212},{"$f":"ROUND(SUMIF(Tabella1[Centro di costo*],$A9&\" - \"&$C9,Tabella1[Val. invest. LAMal dopo ammort. senza amm. eccess.])+SUMIF(Tabella1[Centro di costo*],$A33&\" - \"&$C33,Tabella1[Val. invest. LAMal dopo ammort. senza amm. eccess.])+SUMIF(Tabella1[Centro di costo*],$A34&\" - \"&$C34,Tabella1[Val. invest. LAMal dopo ammort. senza amm. eccess.])+SUMIF(Tabella1[Centro di costo*],$A35&\" - \"&$C35,Tabella1[Val. invest. LAMal dopo ammort. senza amm. eccess.])+SUMIF(Tabella1[Centro di costo*],$A36&\" - \"&$C36,Tabella1[Val. invest. LAMal dopo ammort. senza amm. eccess.])+SUMIF(Tabella1[Centro di costo*],$A37&\" - \"&$C37,Tabella1[Val. invest. LAMal dopo ammort. senza amm. eccess.])+SUMIF(Tabella1[Centro di costo*],$A39&\" - \"&$C39,Tabella1[Val. invest. LAMal dopo ammort. senza amm. eccess.]),0)","v":0},{"$f":"ROUND(SUMIF(Tabella1[Centro di costo*],$A9&\" - \"&$C9,Tabella1[Ammortamento calcolatorio annuo])+SUMIF(Tabella1[Centro di costo*],$A33&\" - \"&$C33,Tabella1[Ammortamento calcolatorio annuo])+SUMIF(Tabella1[Centro di costo*],$A34&\" - \"&$C34,Tabella1[Ammortamento calcolatorio annuo])+SUMIF(Tabella1[Centro di costo*],$A35&\" - \"&$C35,Tabella1[Ammortamento calcolatorio annuo])+SUMIF(Tabella1[Centro di costo*],$A36&\" - \"&$C36,Tabella1[Ammortamento calcolatorio annuo])+SUMIF(Tabella1[Centro di costo*],$A37&\" - \"&$C37,Tabella1[Ammortamento calcolatorio annuo])+SUMIF(Tabella1[Centro di costo*],$A39&\" - \"&$C39,Tabella1[Ammortamento calcolatorio annuo]),0)","v":681818},{"$f":"ROUND(SUMIF(Tabella1[Centro di costo*],$A9&\" - \"&$C9,Tabella1[Ammortamento calcolatorio annuo, riconosciuto  LAMal])+SUMIF(Tabella1[Centro di costo*],$A33&\" - \"&$C33,Tabella1[Ammortamento calcolatorio annuo, riconosciuto  LAMal])+SUMIF(Tabella1[Centro di costo*],$A34&\" - \"&$C34,Tabella1[Ammortamento calcolatorio annuo, riconosciuto  LAMal])+SUMIF(Tabella1[Centro di costo*],$A35&\" - \"&$C35,Tabella1[Ammortamento calcolatorio annuo, riconosciuto  LAMal])+SUMIF(Tabella1[Centro di costo*],$A36&\" - \"&$C36,Tabella1[Ammortamento calcolatorio annuo, riconosciuto  LAMal])+SUMIF(Tabella1[Centro di costo*],$A37&\" - \"&$C37,Tabella1[Ammortamento calcolatorio annuo, riconosciuto  LAMal])+SUMIF(Tabella1[Centro di costo*],$A39&\" - \"&$C39,Tabella1[Ammortamento calcolatorio annuo, riconosciuto  LAMal]),0)","v":0},{"$f":"ROUND(SUMIF(Tabella1[Centro di costo*],$A9&\" - \"&$C9,Tabella1[Val. invest. per calcolo interessi])+SUMIF(Tabella1[Centro di costo*],$A33&\" - \"&$C33,Tabella1[Val. invest. per calcolo interessi])+SUMIF(Tabella1[Centro di costo*],$A34&\" - \"&$C34,Tabella1[Val. invest. per calcolo interessi])+SUMIF(Tabella1[Centro di costo*],$A35&\" - \"&$C35,Tabella1[Val. invest. per calcolo interessi])+SUMIF(Tabella1[Centro di costo*],$A36&\" - \"&$C36,Tabella1[Val. invest. per calcolo interessi])+SUMIF(Tabella1[Centro di costo*],$A37&\" - \"&$C37,Tabella1[Val. invest. per calcolo interessi])+SUMIF(Tabella1[Centro di costo*],$A39&\" - \"&$C39,Tabella1[Val. invest. per calcolo interessi]),0)","v":15300000},{"$f":"ROUND(SUMIF(Tabella1[Centro di costo*],$A9&\" - \"&$C9,Tabella1[Interessi calcolatori annui])+SUMIF(Tabella1[Centro di costo*],$A33&\" - \"&$C33,Tabella1[Interessi calcolatori annui])+SUMIF(Tabella1[Centro di costo*],$A34&\" - \"&$C34,Tabella1[Interessi calcolatori annui])+SUMIF(Tabella1[Centro di costo*],$A35&\" - \"&$C35,Tabella1[Interessi calcolatori annui])+SUMIF(Tabella1[Centro di costo*],$A36&\" - \"&$C36,Tabella1[Interessi calcolatori annui])+SUMIF(Tabella1[Centro di costo*],$A37&\" - \"&$C37,Tabella1[Interessi calcolatori annui])+SUMIF(Tabella1[Centro di costo*],$A39&\" - \"&$C39,Tabella1[Interessi calcolatori annui]),0)","v":566100},{"$f":"ROUND(SUMIF(Tabella1[Centro di costo*],$A9&\" - \"&$C9,Tabella1[Interessi calcolatori annui, riconosciuti LAMal])+SUMIF(Tabella1[Centro di costo*],$A33&\" - \"&$C33,Tabella1[Interessi calcolatori annui, riconosciuti LAMal])+SUMIF(Tabella1[Centro di costo*],$A34&\" - \"&$C34,Tabella1[Interessi calcolatori annui, riconosciuti LAMal])+SUMIF(Tabella1[Centro di costo*],$A35&\" - \"&$C35,Tabella1[Interessi calcolatori annui, riconosciuti LAMal])+SUMIF(Tabella1[Centro di costo*],$A36&\" - \"&$C36,Tabella1[Interessi calcolatori annui, riconosciuti LAMal])+SUMIF(Tabella1[Centro di costo*],$A37&\" - \"&$C37,Tabella1[Interessi calcolatori annui, riconosciuti LAMal])+SUMIF(Tabella1[Centro di costo*],$A39&\" - \"&$C39,Tabella1[Interessi calcolatori annui, riconosciuti LAMal]),0)","v":0},{"$f":"H109+K109","v":1247918},{"$f":"I109+L109","v":0},{"$f":"IF(N109>0,+N109/M109,0)","v":0}]
[{"$f":"'Codici COIN'!B43","v":"011"},{"$f":"'Codici COIN'!C43","v":"015"},{"$f":"'Codici COIN'!E43","v":"Energia"},{"$f":"ROUND(SUMIF(Tabella1[Centro di costo*],$A10&\" - \"&$C10,Tabella1[Valore iniziale totale d''investimento]),0)","v":90000},{"$f":"ROUND(SUMIF(Tabella1[Centro di costo*],$A10&\" - \"&$C10,Tabella1[Contributi dei Comuni (6900)])+SUMIF(Tabella1[Centro di costo*],$A10&\" - \"&$C10,Tabella1[Contributi dei Cantoni (6950)])+SUMIF(Tabella1[Centro di costo*],$A10&\" - \"&$C10,Tabella1[Contributi della Confederazione (6960)])+SUMIF(Tabella1[Centro di costo*],$A10&\" - \"&$C10,Tabella1[Utilizzo fondo 3 manutenzione e investimenti]),0)","v":90000},{"$f":"ROUND(SUMIF(Tabella1[Centro di costo*],$A10&\" - \"&$C10,Tabella1[Val. invest. al 31.12. dopo ammortamento]),0)","v":62625},{"$f":"ROUND(SUMIF(Tabella1[Centro di costo*],$A10&\" - \"&$C10,Tabella1[Val. invest. LAMal dopo ammort. senza amm. eccess.]),0)","v":0},{"$f":"ROUND(SUMIF(Tabella1[Centro di costo*],$A10&\" - \"&$C10,Tabella1[Ammortamento calcolatorio annuo]),0)","v":4500},{"$f":"ROUND(SUMIF(Tabella1[Centro di costo*],$A10&\" - \"&$C10,Tabella1[Ammortamento calcolatorio annuo, riconosciuto  LAMal]),0)","v":0},{"$f":"ROUND(SUMIF(Tabella1[Centro di costo*],$A10&\" - \"&$C10,Tabella1[Val. invest. per calcolo interessi]),0)","v":45000},{"$f":"ROUND(SUMIF(Tabella1[Centro di costo*],$A10&\" - \"&$C10,Tabella1[Interessi calcolatori annui]),0)","v":1665},{"$f":"ROUND(SUMIF(Tabella1[Centro di costo*],$A10&\" - \"&$C10,Tabella1[Interessi calcolatori annui, riconosciuti LAMal]),0)","v":0},{"$f":"H110+K110","v":6165},{"$f":"I110+L110","v":0},0]
[{"$f":"'Codici COIN'!B44","v":"020"},{"$f":"'Codici COIN'!C44","v":"020"},{"$f":"'Codici COIN'!E44","v":"Servizio tecnico"},{"$f":"ROUND(SUMIF(Tabella1[Centro di costo*],$A11&\" - \"&$C11,Tabella1[Valore iniziale totale d''investimento]),0)","v":120000},{"$f":"ROUND(SUMIF(Tabella1[Centro di costo*],$A11&\" - \"&$C11,Tabella1[Contributi dei Comuni (6900)])+SUMIF(Tabella1[Centro di costo*],$A11&\" - \"&$C11,Tabella1[Contributi dei Cantoni (6950)])+SUMIF(Tabella1[Centro di costo*],$A11&\" - \"&$C11,Tabella1[Contributi della Confederazione (6960)])+SUMIF(Tabella1[Centro di costo*],$A11&\" - \"&$C11,Tabella1[Utilizzo fondo 3 manutenzione e investimenti]),0)","v":120000},{"$f":"ROUND(SUMIF(Tabella1[Centro di costo*],$A11&\" - \"&$C11,Tabella1[Val. invest. al 31.12. dopo ammortamento]),0)","v":70000},{"$f":"ROUND(SUMIF(Tabella1[Centro di costo*],$A11&\" - \"&$C11,Tabella1[Val. invest. LAMal dopo ammort. senza amm. eccess.]),0)","v":0},{"$f":"ROUND(SUMIF(Tabella1[Centro di costo*],$A11&\" - \"&$C11,Tabella1[Ammortamento calcolatorio annuo]),0)","v":6000},{"$f":"ROUND(SUMIF(Tabella1[Centro di costo*],$A11&\" - \"&$C11,Tabella1[Ammortamento calcolatorio annuo, riconosciuto  LAMal]),0)","v":0},{"$f":"ROUND(SUMIF(Tabella1[Centro di costo*],$A11&\" - \"&$C11,Tabella1[Val. invest. per calcolo interessi]),0)","v":60000},{"$f":"ROUND(SUMIF(Tabella1[Centro di costo*],$A11&\" - \"&$C11,Tabella1[Interessi calcolatori annui]),0)","v":2220},{"$f":"ROUND(SUMIF(Tabella1[Centro di costo*],$A11&\" - \"&$C11,Tabella1[Interessi calcolatori annui, riconosciuti LAMal]),0)","v":0},8220,0,0]
[{"$f":"'Codici COIN'!B45","v":"021"},{"$f":"'Codici COIN'!C45","v":"021"},{"$f":"'Codici COIN'!E45","v":"Servizio trasporti"},{"$f":"ROUND(SUMIF(Tabella1[Centro di costo*],$A12&\" - \"&$C12,Tabella1[Valore iniziale totale d''investimento]),0)","v":40000},{"$f":"ROUND(SUMIF(Tabella1[Centro di costo*],$A12&\" - \"&$C12,Tabella1[Contributi dei Comuni (6900)])+SUMIF(Tabella1[Centro di costo*],$A12&\" - \"&$C12,Tabella1[Contributi dei Cantoni (6950)])+SUMIF(Tabella1[Centro di costo*],$A12&\" - \"&$C12,Tabella1[Contributi della Confederazione (6960)])+SUMIF(Tabella1[Centro di costo*],$A12&\" - \"&$C12,Tabella1[Utilizzo fondo 3 manutenzione e investimenti]),0)","v":20000},{"$f":"ROUND(SUMIF(Tabella1[Centro di costo*],$A12&\" - \"&$C12,Tabella1[Val. invest. al 31.12. dopo ammortamento]),0)","v":26667},{"$f":"ROUND(SUMIF(Tabella1[Centro di costo*],$A12&\" - \"&$C12,Tabella1[Val. invest. LAMal dopo ammort. senza amm. eccess.]),0)","v":0},{"$f":"ROUND(SUMIF(Tabella1[Centro di costo*],$A12&\" - \"&$C12,Tabella1[Ammortamento calcolatorio annuo]),0)","v":8000},{"$f":"ROUND(SUMIF(Tabella1[Centro di costo*],$A12&\" - \"&$C12,Tabella1[Ammortamento calcolatorio annuo, riconosciuto  LAMal]),0)","v":0},{"$f":"ROUND(SUMIF(Tabella1[Centro di costo*],$A12&\" - \"&$C12,Tabella1[Val. invest. per calcolo interessi]),0)","v":20000},{"$f":"ROUND(SUMIF(Tabella1[Centro di costo*],$A12&\" - \"&$C12,Tabella1[Interessi calcolatori annui]),0)","v":740},{"$f":"ROUND(SUMIF(Tabella1[Centro di costo*],$A12&\" - \"&$C12,Tabella1[Interessi calcolatori annui, riconosciuti LAMal]),0)","v":0},8740,0,0]
[{"$f":"'Codici COIN'!B46","v":"030"},{"$f":"'Codici COIN'!C46","v":"030"},{"$f":"'Codici COIN'!E46","v":"Direzione e amministrazione"},{"$f":"ROUND(SUMIF(Tabella1[Centro di costo*],$A13&\" - \"&$C13,Tabella1[Valore iniziale totale d''investimento]),0)","v":180000},{"$f":"ROUND(SUMIF(Tabella1[Centro di costo*],$A13&\" - \"&$C13,Tabella1[Contributi dei Comuni (6900)])+SUMIF(Tabella1[Centro di costo*],$A13&\" - \"&$C13,Tabella1[Contributi dei Cantoni (6950)])+SUMIF(Tabella1[Centro di costo*],$A13&\" - \"&$C13,Tabella1[Contributi della Confederazione (6960)])+SUMIF(Tabella1[Centro di costo*],$A13&\" - \"&$C13,Tabella1[Utilizzo fondo 3 manutenzione e investimenti]),0)","v":100000},{"$f":"ROUND(SUMIF(Tabella1[Centro di costo*],$A13&\" - \"&$C13,Tabella1[Val. invest. al 31.12. dopo ammortamento]),0)","v":40313},{"$f":"ROUND(SUMIF(Tabella1[Centro di costo*],$A13&\" - \"&$C13,Tabella1[Val. invest. LAMal dopo ammort. senza amm. eccess.]),0)","v":0},{"$f":"ROUND(SUMIF(Tabella1[Centro di costo*],$A13&\" - \"&$C13,Tabella1[Ammortamento calcolatorio annuo]),0)","v":86417},{"$f":"ROUND(SUMIF(Tabella1[Centro di costo*],$A13&\" - \"&$C13,Tabella1[Ammortamento calcolatorio annuo, riconosciuto  LAMal]),0)","v":0},{"$f":"ROUND(SUMIF(Tabella1[Centro di costo*],$A13&\" - \"&$C13,Tabella1[Val. invest. per calcolo interessi]),0)","v":90000},{"$f":"ROUND(SUMIF(Tabella1[Centro di costo*],$A13&\" - \"&$C13,Tabella1[Interessi calcolatori annui]),0)","v":3083},{"$f":"ROUND(SUMIF(Tabella1[Centro di costo*],$A13&\" - \"&$C13,Tabella1[Interessi calcolatori annui, riconosciuti LAMal]),0)","v":0},89500,0,0]
[{"$f":"'Codici COIN'!B47","v":"040"},{"$f":"'Codici COIN'!C47","v":"040"},{"$f":"'Codici COIN'!E47","v":"Economia domestica in generale"},{"$f":"ROUND(SUMIF(Tabella1[Centro di costo*],$A14&\" - \"&$C14,Tabella1[Valore iniziale totale d''investimento]),0)","v":0},{"$f":"ROUND(SUMIF(Tabella1[Centro di costo*],$A14&\" - \"&$C14,Tabella1[Contributi dei Comuni (6900)])+SUMIF(Tabella1[Centro di costo*],$A14&\" - \"&$C14,Tabella1[Contributi dei Cantoni (6950)])+SUMIF(Tabella1[Centro di costo*],$A14&\" - \"&$C14,Tabella1[Contributi della Confederazione (6960)])+SUMIF(Tabella1[Centro di costo*],$A14&\" - \"&$C14,Tabella1[Utilizzo fondo 3 manutenzione e investimenti]),0)","v":0},{"$f":"ROUND(SUMIF(Tabella1[Centro di costo*],$A14&\" - \"&$C14,Tabella1[Val. invest. al 31.12. dopo ammortamento]),0)","v":0},{"$f":"ROUND(SUMIF(Tabella1[Centro di costo*],$A14&\" - \"&$C14,Tabella1[Val. invest. LAMal dopo ammort. senza amm. eccess.]),0)","v":0},{"$f":"ROUND(SUMIF(Tabella1[Centro di costo*],$A14&\" - \"&$C14,Tabella1[Ammortamento calcolatorio annuo]),0)","v":0},{"$f":"ROUND(SUMIF(Tabella1[Centro di costo*],$A14&\" - \"&$C14,Tabella1[Ammortamento calcolatorio annuo, riconosciuto  LAMal]),0)","v":0},{"$f":"ROUND(SUMIF(Tabella1[Centro di costo*],$A14&\" - \"&$C14,Tabella1[Val. invest. per calcolo interessi]),0)","v":0},{"$f":"ROUND(SUMIF(Tabella1[Centro di costo*],$A14&\" - \"&$C14,Tabella1[Interessi calcolatori annui]),0)","v":0},{"$f":"ROUND(SUMIF(Tabella1[Centro di costo*],$A14&\" - \"&$C14,Tabella1[Interessi calcolatori annui, riconosciuti LAMal]),0)","v":0},0,0,0]
[{"$f":"'Codici COIN'!B48","v":"041"},{"$f":"'Codici COIN'!C48","v":"041"},{"$f":"'Codici COIN'!E48","v":"Lavanderia"},{"$f":"ROUND(SUMIF(Tabella1[Centro di costo*],$A15&\" - \"&$C15,Tabella1[Valore iniziale totale d''investimento]),0)","v":33000},{"$f":"ROUND(SUMIF(Tabella1[Centro di costo*],$A15&\" - \"&$C15,Tabella1[Contributi dei Comuni (6900)])+SUMIF(Tabella1[Centro di costo*],$A15&\" - \"&$C15,Tabella1[Contributi dei Cantoni (6950)])+SUMIF(Tabella1[Centro di costo*],$A15&\" - \"&$C15,Tabella1[Contributi della Confederazione (6960)])+SUMIF(Tabella1[Centro di costo*],$A15&\" - \"&$C15,Tabella1[Utilizzo fondo 3 manutenzione e investimenti]),0)","v":33000},{"$f":"ROUND(SUMIF(Tabella1[Centro di costo*],$A15&\" - \"&$C15,Tabella1[Val. invest. al 31.12. dopo ammortamento]),0)","v":7150},{"$f":"ROUND(SUMIF(Tabella1[Centro di costo*],$A15&\" - \"&$C15,Tabella1[Val. invest. LAMal dopo ammort. senza amm. eccess.]),0)","v":0},{"$f":"ROUND(SUMIF(Tabella1[Centro di costo*],$A15&\" - \"&$C15,Tabella1[Ammortamento calcolatorio annuo]),0)","v":3300},{"$f":"ROUND(SUMIF(Tabella1[Centro di costo*],$A15&\" - \"&$C15,Tabella1[Ammortamento calcolatorio annuo, riconosciuto  LAMal]),0)","v":0},{"$f":"ROUND(SUMIF(Tabella1[Centro di costo*],$A15&\" - \"&$C15,Tabella1[Val. invest. per calcolo interessi]),0)","v":16500},{"$f":"ROUND(SUMIF(Tabella1[Centro di costo*],$A15&\" - \"&$C15,Tabella1[Interessi calcolatori annui]),0)","v":611},{"$f":"ROUND(SUMIF(Tabella1[Centro di costo*],$A15&\" - \"&$C15,Tabella1[Interessi calcolatori annui, riconosciuti LAMal]),0)","v":0},3911,0,0]
[{"$f":"'Codici COIN'!B49","v":"042"},{"$f":"'Codici COIN'!C49","v":"042"},{"$f":"'Codici COIN'!E49","v":"Pulizia"},{"$f":"ROUND(SUMIF(Tabella1[Centro di costo*],$A16&\" - \"&$C16,Tabella1[Valore iniziale totale d''investimento]),0)","v":5500},{"$f":"ROUND(SUMIF(Tabella1[Centro di costo*],$A16&\" - \"&$C16,Tabella1[Contributi dei Comuni (6900)])+SUMIF(Tabella1[Centro di costo*],$A16&\" - \"&$C16,Tabella1[Contributi dei Cantoni (6950)])+SUMIF(Tabella1[Centro di costo*],$A16&\" - \"&$C16,Tabella1[Contributi della Confederazione (6960)])+SUMIF(Tabella1[Centro di costo*],$A16&\" - \"&$C16,Tabella1[Utilizzo fondo 3 manutenzione e investimenti]),0)","v":5500},{"$f":"ROUND(SUMIF(Tabella1[Centro di costo*],$A16&\" - \"&$C16,Tabella1[Val. invest. al 31.12. dopo ammortamento]),0)","v":3483},{"$f":"ROUND(SUMIF(Tabella1[Centro di costo*],$A16&\" - \"&$C16,Tabella1[Val. invest. LAMal dopo ammort. senza amm. eccess.]),0)","v":0},{"$f":"ROUND(SUMIF(Tabella1[Centro di costo*],$A16&\" - \"&$C16,Tabella1[Ammortamento calcolatorio annuo]),0)","v":1100},{"$f":"ROUND(SUMIF(Tabella1[Centro di costo*],$A16&\" - \"&$C16,Tabella1[Ammortamento calcolatorio annuo, riconosciuto  LAMal]),0)","v":0},{"$f":"ROUND(SUMIF(Tabella1[Centro di costo*],$A16&\" - \"&$C16,Tabella1[Val. invest. per calcolo interessi]),0)","v":2750},{"$f":"ROUND(SUMIF(Tabella1[Centro di costo*],$A16&\" - \"&$C16,Tabella1[Interessi calcolatori annui]),0)","v":102},{"$f":"ROUND(SUMIF(Tabella1[Centro di costo*],$A16&\" - \"&$C16,Tabella1[Interessi calcolatori annui, riconosciuti LAMal]),0)","v":0},1202,0,0]
[{"$f":"'Codici COIN'!B50","v":"060"},{"$f":"'Codici COIN'!C50","v":"060"},{"$f":"'Codici COIN'!E50","v":"Cucina"},{"$f":"ROUND(SUMIF(Tabella1[Centro di costo*],$A17&\" - \"&$C17,Tabella1[Valore iniziale totale d''investimento]),0)","v":38000},{"$f":"ROUND(SUMIF(Tabella1[Centro di costo*],$A17&\" - \"&$C17,Tabella1[Contributi dei Comuni (6900)])+SUMIF(Tabella1[Centro di costo*],$A17&\" - \"&$C17,Tabella1[Contributi dei Cantoni (6950)])+SUMIF(Tabella1[Centro di costo*],$A17&\" - \"&$C17,Tabella1[Contributi della Confederazione (6960)])+SUMIF(Tabella1[Centro di costo*],$A17&\" - \"&$C17,Tabella1[Utilizzo fondo 3 manutenzione e investimenti]),0)","v":38000},{"$f":"ROUND(SUMIF(Tabella1[Centro di costo*],$A17&\" - \"&$C17,Tabella1[Val. invest. al 31.12. dopo ammortamento]),0)","v":15517},{"$f":"ROUND(SUMIF(Tabella1[Centro di costo*],$A17&\" - \"&$C17,Tabella1[Val. invest. LAMal dopo ammort. senza amm. eccess.]),0)","v":0},{"$f":"ROUND(SUMIF(Tabella1[Centro di costo*],$A17&\" - \"&$C17,Tabella1[Ammortamento calcolatorio annuo]),0)","v":3800},{"$f":"ROUND(SUMIF(Tabella1[Centro di costo*],$A17&\" - \"&$C17,Tabella1[Ammortamento calcolatorio annuo, riconosciuto  LAMal]),0)","v":0},{"$f":"ROUND(SUMIF(Tabella1[Centro di costo*],$A17&\" - \"&$C17,Tabella1[Val. invest. per calcolo interessi]),0)","v":19000},{"$f":"ROUND(SUMIF(Tabella1[Centro di costo*],$A17&\" - \"&$C17,Tabella1[Interessi calcolatori annui]),0)","v":703},{"$f":"ROUND(SUMIF(Tabella1[Centro di costo*],$A17&\" - \"&$C17,Tabella1[Interessi calcolatori annui, riconosciuti LAMal]),0)","v":0},4503,0,0]
[{"$f":"'Codici COIN'!B51","v":"090"},{"$f":"'Codici COIN'!C51","v":"090"},{"$f":"'Codici COIN'!E51","v":"Magazzino centrale"},{"$f":"ROUND(SUMIF(Tabella1[Centro di costo*],$A18&\" - \"&$C18,Tabella1[Valore iniziale totale d''investimento]),0)","v":0},{"$f":"ROUND(SUMIF(Tabella1[Centro di costo*],$A18&\" - \"&$C18,Tabella1[Contributi dei Comuni (6900)])+SUMIF(Tabella1[Centro di costo*],$A18&\" - \"&$C18,Tabella1[Contributi dei Cantoni (6950)])+SUMIF(Tabella1[Centro di costo*],$A18&\" - \"&$C18,Tabella1[Contributi della Confederazione (6960)])+SUMIF(Tabella1[Centro di costo*],$A18&\" - \"&$C18,Tabella1[Utilizzo fondo 3 manutenzione e investimenti]),0)","v":0},{"$f":"ROUND(SUMIF(Tabella1[Centro di costo*],$A18&\" - \"&$C18,Tabella1[Val. invest. al 31.12. dopo ammortamento]),0)","v":0},{"$f":"ROUND(SUMIF(Tabella1[Centro di costo*],$A18&\" - \"&$C18,Tabella1[Val. invest. LAMal dopo ammort. senza amm. eccess.]),0)","v":0},{"$f":"ROUND(SUMIF(Tabella1[Centro di costo*],$A18&\" - \"&$C18,Tabella1[Ammortamento calcolatorio annuo]),0)","v":0},{"$f":"ROUND(SUMIF(Tabella1[Centro di costo*],$A18&\" - \"&$C18,Tabella1[Ammortamento calcolatorio annuo, riconosciuto  LAMal]),0)","v":0},{"$f":"ROUND(SUMIF(Tabella1[Centro di costo*],$A18&\" - \"&$C18,Tabella1[Val. invest. per calcolo interessi]),0)","v":0},{"$f":"ROUND(SUMIF(Tabella1[Centro di costo*],$A18&\" - \"&$C18,Tabella1[Interessi calcolatori annui]),0)","v":0},{"$f":"ROUND(SUMIF(Tabella1[Centro di costo*],$A18&\" - \"&$C18,Tabella1[Interessi calcolatori annui, riconosciuti LAMal]),0)","v":0},0,0,0]
[{"$f":"'Codici COIN'!B52","v":"095"},{"$f":"'Codici COIN'!C52","v":"095"},{"$f":"'Codici COIN'!E52","v":"Farmacia"},{"$f":"ROUND(SUMIF(Tabella1[Centro di costo*],$A19&\" - \"&$C19,Tabella1[Valore iniziale totale d''investimento]),0)","v":12000},{"$f":"ROUND(SUMIF(Tabella1[Centro di costo*],$A19&\" - \"&$C19,Tabella1[Contributi dei Comuni (6900)])+SUMIF(Tabella1[Centro di costo*],$A19&\" - \"&$C19,Tabella1[Contributi dei Cantoni (6950)])+SUMIF(Tabella1[Centro di costo*],$A19&\" - \"&$C19,Tabella1[Contributi della Confederazione (6960)])+SUMIF(Tabella1[Centro di costo*],$A19&\" - \"&$C19,Tabella1[Utilizzo fondo 3 manutenzione e investimenti]),0)","v":12000},{"$f":"ROUND(SUMIF(Tabella1[Centro di costo*],$A19&\" - \"&$C19,Tabella1[Val. invest. al 31.12. dopo ammortamento]),0)","v":6500},{"$f":"ROUND(SUMIF(Tabella1[Centro di costo*],$A19&\" - \"&$C19,Tabella1[Val. invest. LAMal dopo ammort. senza amm. eccess.]),0)","v":0},{"$f":"ROUND(SUMIF(Tabella1[Centro di costo*],$A19&\" - \"&$C19,Tabella1[Ammortamento calcolatorio annuo]),0)","v":1200},{"$f":"ROUND(SUMIF(Tabella1[Centro di costo*],$A19&\" - \"&$C19,Tabella1[Ammortamento calcolatorio annuo, riconosciuto  LAMal]),0)","v":0},{"$f":"ROUND(SUMIF(Tabella1[Centro di costo*],$A19&\" - \"&$C19,Tabella1[Val. invest. per calcolo interessi]),0)","v":6000},{"$f":"ROUND(SUMIF(Tabella1[Centro di costo*],$A19&\" - \"&$C19,Tabella1[Interessi calcolatori annui]),0)","v":222},{"$f":"ROUND(SUMIF(Tabella1[Centro di costo*],$A19&\" - \"&$C19,Tabella1[Interessi calcolatori annui, riconosciuti LAMal]),0)","v":0},1422,0,0]
[]
["Totale CdC principali",null,null,{"$f":"SUM(D122:D128)","v":277000},{"$f":"SUM(E122:E128)","v":249000},178093,0,26454,0,138500,4651,0,{"$f":"SUM(M122:M128)","v":31105},{"$f":"SUM(N122:N128)","v":0},{"$f":"IF(N121>0,+N121/M121,0)","v":0}]
[{"$f":"'Codici COIN'!B54","v":100},{"$f":"'Codici COIN'!C54","v":220},{"$f":"'Codici COIN'!E54","v":"Servizio alberghiero"},{"$f":"ROUND(SUMIF(Tabella1[Centro di costo*],$A22&\" - \"&$C22,Tabella1[Valore iniziale totale d''investimento]),0)","v":160000},{"$f":"ROUND(SUMIF(Tabella1[Centro di costo*],$A22&\" - \"&$C22,Tabella1[Contributi dei Comuni (6900)])+SUMIF(Tabella1[Centro di costo*],$A22&\" - \"&$C22,Tabella1[Contributi dei Cantoni (6950)])+SUMIF(Tabella1[Centro di costo*],$A22&\" - \"&$C22,Tabella1[Contributi della Confederazione (6960)])+SUMIF(Tabella1[Centro di costo*],$A22&\" - \"&$C22,Tabella1[Utilizzo fondo 3 manutenzione e investimenti]),0)","v":160000},{"$f":"ROUND(SUMIF(Tabella1[Centro di costo*],$A22&\" - \"&$C22,Tabella1[Val. invest. al 31.12. dopo ammortamento]),0)","v":106875},{"$f":"ROUND(SUMIF(Tabella1[Centro di costo*],$A22&\" - \"&$C22,Tabella1[Val. invest. LAMal dopo ammort. senza amm. eccess.]),0)","v":0},{"$f":"ROUND(SUMIF(Tabella1[Centro di costo*],$A22&\" - \"&$C22,Tabella1[Ammortamento calcolatorio annuo]),0)","v":15208},{"$f":"ROUND(SUMIF(Tabella1[Centro di costo*],$A22&\" - \"&$C22,Tabella1[Ammortamento calcolatorio annuo, riconosciuto  LAMal]),0)","v":0},{"$f":"ROUND(SUMIF(Tabella1[Centro di costo*],$A22&\" - \"&$C22,Tabella1[Val. invest. per calcolo interessi]),0)","v":80000},{"$f":"ROUND(SUMIF(Tabella1[Centro di costo*],$A22&\" - \"&$C22,Tabella1[Interessi calcolatori annui]),0)","v":2652},{"$f":"ROUND(SUMIF(Tabella1[Centro di costo*],$A22&\" - \"&$C22,Tabella1[Interessi calcolatori annui, riconosciuti LAMal]),0)","v":0},{"$f":"H122+K122","v":17860},{"$f":"+I122+L122","v":0},{"$f":"IF(N122>0,+N122/M122,0)","v":0}]
[{"$f":"'Codici COIN'!B55","v":110},{"$f":"'Codici COIN'!C55","v":230},{"$f":"'Codici COIN'!E55","v":"Animazione (Assistenza non LAMal)"},{"$f":"ROUND(SUMIF(Tabella1[Centro di costo*],$A23&\" - \"&$C23,Tabella1[Valore iniziale totale d''investimento]),0)","v":70000},{"$f":"ROUND(SUMIF(Tabella1[Centro di costo*],$A23&\" - \"&$C23,Tabella1[Contributi dei Comuni (6900)])+SUMIF(Tabella1[Centro di costo*],$A23&\" - \"&$C23,Tabella1[Contributi dei Cantoni (6950)])+SUMIF(Tabella1[Centro di costo*],$A23&\" - \"&$C23,Tabella1[Contributi della Confederazione (6960)])+SUMIF(Tabella1[Centro di costo*],$A23&\" - \"&$C23,Tabella1[Utilizzo fondo 3 manutenzione e investimenti]),0)","v":42000},{"$f":"ROUND(SUMIF(Tabella1[Centro di costo*],$A23&\" - \"&$C23,Tabella1[Val. invest. al 31.12. dopo ammortamento]),0)","v":47197},{"$f":"ROUND(SUMIF(Tabella1[Centro di costo*],$A23&\" - \"&$C23,Tabella1[Val. invest. LAMal dopo ammort. senza amm. eccess.]),0)","v":0},{"$f":"ROUND(SUMIF(Tabella1[Centro di costo*],$A23&\" - \"&$C23,Tabella1[Ammortamento calcolatorio annuo]),0)","v":2121},{"$f":"ROUND(SUMIF(Tabella1[Centro di costo*],$A23&\" - \"&$C23,Tabella1[Ammortamento calcolatorio annuo, riconosciuto  LAMal]),0)","v":0},{"$f":"ROUND(SUMIF(Tabella1[Centro di costo*],$A23&\" - \"&$C23,Tabella1[Val. invest. per calcolo interessi]),0)","v":35000},{"$f":"ROUND(SUMIF(Tabella1[Centro di costo*],$A23&\" - \"&$C23,Tabella1[Interessi calcolatori annui]),0)","v":1295},{"$f":"ROUND(SUMIF(Tabella1[Centro di costo*],$A23&\" - \"&$C23,Tabella1[Interessi calcolatori annui, riconosciuti LAMal]),0)","v":0},3416,{"$f":"+I123+L123","v":0},0]
[{"$f":"'Codici COIN'!B56","v":115},{"$f":"'Codici COIN'!C56","v":231},{"$f":"'Codici COIN'!E56","v":"Cure LAMal"},{"$f":"ROUND(SUMIF(Tabella1[Centro di costo*],$A24&\" - \"&$C24,Tabella1[Valore iniziale totale d''investimento]),0)","v":35000},{"$f":"ROUND(SUMIF(Tabella1[Centro di costo*],$A24&\" - \"&$C24,Tabella1[Contributi dei Comuni (6900)])+SUMIF(Tabella1[Centro di costo*],$A24&\" - \"&$C24,Tabella1[Contributi dei Cantoni (6950)])+SUMIF(Tabella1[Centro di costo*],$A24&\" - \"&$C24,Tabella1[Contributi della Confederazione (6960)])+SUMIF(Tabella1[Centro di costo*],$A24&\" - \"&$C24,Tabella1[Utilizzo fondo 3 manutenzione e investimenti]),0)","v":35000},{"$f":"ROUND(SUMIF(Tabella1[Centro di costo*],$A24&\" - \"&$C24,Tabella1[Val. invest. al 31.12. dopo ammortamento]),0)","v":12396},{"$f":"ROUND(SUMIF(Tabella1[Centro di costo*],$A24&\" - \"&$C24,Tabella1[Val. invest. LAMal dopo ammort. senza amm. eccess.]),0)","v":0},{"$f":"ROUND(SUMIF(Tabella1[Centro di costo*],$A24&\" - \"&$C24,Tabella1[Ammortamento calcolatorio annuo]),0)","v":8750},{"$f":"ROUND(SUMIF(Tabella1[Centro di costo*],$A24&\" - \"&$C24,Tabella1[Ammortamento calcolatorio annuo, riconosciuto  LAMal]),0)","v":0},{"$f":"ROUND(SUMIF(Tabella1[Centro di costo*],$A24&\" - \"&$C24,Tabella1[Val. invest. per calcolo interessi]),0)","v":17500},{"$f":"ROUND(SUMIF(Tabella1[Centro di costo*],$A24&\" - \"&$C24,Tabella1[Interessi calcolatori annui]),0)","v":648},{"$f":"ROUND(SUMIF(Tabella1[Centro di costo*],$A24&\" - \"&$C24,Tabella1[Interessi calcolatori annui, riconosciuti LAMal]),0)","v":0},9398,0,0]
[{"$f":"'Codici COIN'!B57","v":"(130-132)"},{"$f":"'Codici COIN'!C57","v":241},{"$f":"'Codici COIN'!E57","v":"Terapie LAMal (fisio+ergo+altre)"},{"$f":"ROUND(SUMIF(Tabella1[Centro di costo*],$A25&\" - \"&$C25,Tabella1[Valore iniziale totale d''investimento])+SUMIF(Tabella1[Centro di costo*],$A26&\" - \"&$C26,Tabella1[Valore iniziale totale d''investimento])+SUMIF(Tabella1[Centro di costo*],$A27&\" - \"&$C27,Tabella1[Valore iniziale totale d''investimento]),0)","v":12000},{"$f":"ROUND(SUMIF(Tabella1[Centro di costo*],$A25&\" - \"&$C25,Tabella1[Contributi dei Comuni (6900)])+SUMIF(Tabella1[Centro di costo*],$A25&\" - \"&$C25,Tabella1[Contributi dei Cantoni (6950)])+SUMIF(Tabella1[Centro di costo*],$A25&\" - \"&$C25,Tabella1[Contributi della Confederazione (6960)])+SUMIF(Tabella1[Centro di costo*],$A25&\" - \"&$C25,Tabella1[Utilizzo fondo 3 manutenzione e investimenti])+SUMIF(Tabella1[Centro di costo*],$A26&\" - \"&$C26,Tabella1[Contributi dei Comuni (6900)])+SUMIF(Tabella1[Centro di costo*],$A26&\" - \"&$C26,Tabella1[Contributi dei Cantoni (6950)])+SUMIF(Tabella1[Centro di costo*],$A26&\" - \"&$C26,Tabella1[Contributi della Confederazione (6960)])+SUMIF(Tabella1[Centro di costo*],$A26&\" - \"&$C26,Tabella1[Utilizzo fondo 3 manutenzione e investimenti])+SUMIF(Tabella1[Centro di costo*],$A27&\" - \"&$C27,Tabella1[Contributi dei Comuni (6900)])+SUMIF(Tabella1[Centro di costo*],$A27&\" - \"&$C27,Tabella1[Contributi dei Cantoni (6950)])+SUMIF(Tabella1[Centro di costo*],$A27&\" - \"&$C27,Tabella1[Contributi della Confederazione (6960)])+SUMIF(Tabella1[Centro di costo*],$A27&\" - \"&$C27,Tabella1[Utilizzo fondo 3 manutenzione e investimenti]),0)","v":12000},{"$f":"ROUND(SUMIF(Tabella1[Centro di costo*],$A25&\" - \"&$C25,Tabella1[Val. invest. al 31.12. dopo ammortamento])+SUMIF(Tabella1[Centro di costo*],$A26&\" - \"&$C26,Tabella1[Val. invest. al 31.12. dopo ammortamento])+SUMIF(Tabella1[Centro di costo*],$A27&\" - \"&$C27,Tabella1[Val. invest. al 31.12. dopo ammortamento]),0)","v":11625},{"$f":"ROUND(SUMIF(Tabella1[Centro di costo*],$A25&\" - \"&$C25,Tabella1[Val. invest. LAMal dopo ammort. senza amm. eccess.])+SUMIF(Tabella1[Centro di costo*],$A26&\" - \"&$C26,Tabella1[Val. invest. LAMal dopo ammort. senza amm. eccess.])+SUMIF(Tabella1[Centro di costo*],$A27&\" - \"&$C27,Tabella1[Val. invest. LAMal dopo ammort. senza amm. eccess.]),0)","v":0},{"$f":"ROUND(SUMIF(Tabella1[Centro di costo*],$A25&\" - \"&$C25,Tabella1[Ammortamento calcolatorio annuo])+SUMIF(Tabella1[Centro di costo*],$A26&\" - \"&$C26,Tabella1[Ammortamento calcolatorio annuo])+SUMIF(Tabella1[Centro di costo*],$A27&\" - \"&$C27,Tabella1[Ammortamento calcolatorio annuo]),0)","v":375},{"$f":"ROUND(SUMIF(Tabella1[Centro di costo*],$A25&\" - \"&$C25,Tabella1[Ammortamento calcolatorio annuo, riconosciuto  LAMal])+SUMIF(Tabella1[Centro di costo*],$A26&\" - \"&$C26,Tabella1[Ammortamento calcolatorio annuo, riconosciuto  LAMal])+SUMIF(Tabella1[Centro di costo*],$A27&\" - \"&$C27,Tabella1[Ammortamento calcolatorio annuo, riconosciuto  LAMal]),0)","v":0},{"$f":"ROUND(SUMIF(Tabella1[Centro di costo*],$A25&\" - \"&$C25,Tabella1[Val. invest. per calcolo interessi])+SUMIF(Tabella1[Centro di costo*],$A26&\" - \"&$C26,Tabella1[Val. invest. per calcolo interessi])+SUMIF(Tabella1[Centro di costo*],$A27&\" - \"&$C27,Tabella1[Val. invest. per calcolo interessi]),0)","v":6000},{"$f":"ROUND(SUMIF(Tabella1[Centro di costo*],$A25&\" - \"&$C25,Tabella1[Interessi calcolatori annui])+SUMIF(Tabella1[Centro di costo*],$A26&\" - \"&$C26,Tabella1[Interessi calcolatori annui])+SUMIF(Tabella1[Centro di costo*],$A27&\" - \"&$C27,Tabella1[Interessi calcolatori annui]),0)","v":56},{"$f":"ROUND(SUMIF(Tabella1[Centro di costo*],$A25&\" - \"&$C25,Tabella1[Interessi calcolatori annui, riconosciuti LAMal])+SUMIF(Tabella1[Centro di costo*],$A26&\" - \"&$C26,Tabella1[Interessi calcolatori annui, riconosciuti LAMal])+SUMIF(Tabella1[Centro di costo*],$A27&\" - \"&$C27,Tabella1[Interessi calcolatori annui, riconosciuti LAMal]),0)","v":0},431,0,0]
[{"$f":"'Codici COIN'!B61","v":140},{"$f":"'Codici COIN'!C61","v":240},{"$f":"'Codici COIN'!E61","v":"Servizio medico"},{"$f":"ROUND(SUMIF(Tabella1[Centro di costo*],$A28&\" - \"&$C28,Tabella1[Valore iniziale totale d''investimento]),0)","v":0},{"$f":"ROUND(SUMIF(Tabella1[Centro di costo*],$A28&\" - \"&$C28,Tabella1[Contributi dei Comuni (6900)])+SUMIF(Tabella1[Centro di costo*],$A28&\" - \"&$C28,Tabella1[Contributi dei Cantoni (6950)])+SUMIF(Tabella1[Centro di costo*],$A28&\" - \"&$C28,Tabella1[Contributi della Confederazione (6960)])+SUMIF(Tabella1[Centro di costo*],$A28&\" - \"&$C28,Tabella1[Utilizzo fondo 3 manutenzione e investimenti]),0)","v":0},{"$f":"ROUND(SUMIF(Tabella1[Centro di costo*],$A28&\" - \"&$C28,Tabella1[Val. invest. al 31.12. dopo ammortamento]),0)","v":0},{"$f":"ROUND(SUMIF(Tabella1[Centro di costo*],$A28&\" - \"&$C28,Tabella1[Val. invest. LAMal dopo ammort. senza amm. eccess.]),0)","v":0},{"$f":"ROUND(SUMIF(Tabella1[Centro di costo*],$A28&\" - \"&$C28,Tabella1[Ammortamento calcolatorio annuo]),0)","v":0},{"$f":"ROUND(SUMIF(Tabella1[Centro di costo*],$A28&\" - \"&$C28,Tabella1[Ammortamento calcolatorio annuo, riconosciuto  LAMal]),0)","v":0},{"$f":"ROUND(SUMIF(Tabella1[Centro di costo*],$A28&\" - \"&$C28,Tabella1[Val. invest. per calcolo interessi]),0)","v":0},{"$f":"ROUND(SUMIF(Tabella1[Centro di costo*],$A28&\" - \"&$C28,Tabella1[Interessi calcolatori annui]),0)","v":0},{"$f":"ROUND(SUMIF(Tabella1[Centro di costo*],$A28&\" - \"&$C28,Tabella1[Interessi calcolatori annui, riconosciuti LAMal]),0)","v":0},0,0,0]
[{"$f":"'Codici COIN'!B62","v":150},{"$f":"'Codici COIN'!C62","v":250},{"$f":"'Codici COIN'!E62","v":"Materiale EMAp"},{"$f":"ROUND(SUMIF(Tabella1[Centro di costo*],$A29&\" - \"&$C29,Tabella1[Valore iniziale totale d''investimento]),0)","v":0},{"$f":"ROUND(SUMIF(Tabella1[Centro di costo*],$A29&\" - \"&$C29,Tabella1[Contributi dei Comuni (6900)])+SUMIF(Tabella1[Centro di costo*],$A29&\" - \"&$C29,Tabella1[Contributi dei Cantoni (6950)])+SUMIF(Tabella1[Centro di costo*],$A29&\" - \"&$C29,Tabella1[Contributi della Confederazione (6960)])+SUMIF(Tabella1[Centro di costo*],$A29&\" - \"&$C29,Tabella1[Utilizzo fondo 3 manutenzione e investimenti]),0)","v":0},{"$f":"ROUND(SUMIF(Tabella1[Centro di costo*],$A29&\" - \"&$C29,Tabella1[Val. invest. al 31.12. dopo ammortamento]),0)","v":0},{"$f":"ROUND(SUMIF(Tabella1[Centro di costo*],$A29&\" - \"&$C29,Tabella1[Val. invest. LAMal dopo ammort. senza amm. eccess.]),0)","v":0},{"$f":"ROUND(SUMIF(Tabella1[Centro di costo*],$A29&\" - \"&$C29,Tabella1[Ammortamento calcolatorio annuo]),0)","v":0},{"$f":"ROUND(SUMIF(Tabella1[Centro di costo*],$A29&\" - \"&$C29,Tabella1[Ammortamento calcolatorio annuo, riconosciuto  LAMal]),0)","v":0},{"$f":"ROUND(SUMIF(Tabella1[Centro di costo*],$A29&\" - \"&$C29,Tabella1[Val. invest. per calcolo interessi]),0)","v":0},{"$f":"ROUND(SUMIF(Tabella1[Centro di costo*],$A29&\" - \"&$C29,Tabella1[Interessi calcolatori annui]),0)","v":0},{"$f":"ROUND(SUMIF(Tabella1[Centro di costo*],$A29&\" - \"&$C29,Tabella1[Interessi calcolatori annui, riconosciuti LAMal]),0)","v":0},0,0,0]
[{"$f":"'Codici COIN'!B63","v":151},{"$f":"'Codici COIN'!C63","v":251},{"$f":"'Codici COIN'!E63","v":"Medicamenti ES/EMT"},{"$f":"ROUND(SUMIF(Tabella1[Centro di costo*],$A30&\" - \"&$C30,Tabella1[Valore iniziale totale d''investimento]),0)","v":0},{"$f":"ROUND(SUMIF(Tabella1[Centro di costo*],$A30&\" - \"&$C30,Tabella1[Contributi dei Comuni (6900)])+SUMIF(Tabella1[Centro di costo*],$A30&\" - \"&$C30,Tabella1[Contributi dei Cantoni (6950)])+SUMIF(Tabella1[Centro di costo*],$A30&\" - \"&$C30,Tabella1[Contributi della Confederazione (6960)])+SUMIF(Tabella1[Centro di costo*],$A30&\" - \"&$C30,Tabella1[Utilizzo fondo 3 manutenzione e investimenti]),0)","v":0},{"$f":"ROUND(SUMIF(Tabella1[Centro di costo*],$A30&\" - \"&$C30,Tabella1[Val. invest. al 31.12. dopo ammortamento]),0)","v":0},{"$f":"ROUND(SUMIF(Tabella1[Centro di costo*],$A30&\" - \"&$C30,Tabella1[Val. invest. LAMal dopo ammort. senza amm. eccess.]),0)","v":0},{"$f":"ROUND(SUMIF(Tabella1[Centro di costo*],$A30&\" - \"&$C30,Tabella1[Ammortamento calcolatorio annuo]),0)","v":0},{"$f":"ROUND(SUMIF(Tabella1[Centro di costo*],$A30&\" - \"&$C30,Tabella1[Ammortamento calcolatorio annuo, riconosciuto  LAMal]),0)","v":0},{"$f":"ROUND(SUMIF(Tabella1[Centro di costo*],$A30&\" - \"&$C30,Tabella1[Val. invest. per calcolo interessi]),0)","v":0},{"$f":"ROUND(SUMIF(Tabella1[Centro di costo*],$A30&\" - \"&$C30,Tabella1[Interessi calcolatori annui]),0)","v":0},{"$f":"ROUND(SUMIF(Tabella1[Centro di costo*],$A30&\" - \"&$C30,Tabella1[Interessi calcolatori annui, riconosciuti LAMal]),0)","v":0},0,0,0]
[]
[]
["Totale (investimenti per i centri di costo SOMED)",null,null,{"$f":"D108+D121","v":27345500},{"$f":"E108+E121","v":16767500},12831560,0,{"$f":"H108+H121","v":822589},0,15697750,{"$f":"K108+K121","v":580097},0,1402686,0,{"$f":"IF(N131>0,+N131/M131,0)","v":0}]
[]
[null,null,null,null,null,null,null,null,"Ripartizione calcolatoria dei costi di utilizzo annuali (colonne AD-AH degli investimenti)"]
[null,null,null,null,null,null,null,null,"Totale dei costi ",null,null,null,{"$f":"SUM(M135:M138)","v":1402685}]
[null,null,null,null,null,null,null,null,"di cui a carico dei Comuni (6900)",null,null,null,{"$f":"ROUND('Cespiti ContabilitàInvestimenti'!AE107-SUMIF(Tabella1[Centro di costo*],$A$38&\" - \"&$C$38,Tabella1[di cui a carico dei Comuni (6900)])-SUMIF(Tabella1[Centro di costo*],$A$40&\" - \"&$C$40,Tabella1[di cui a carico dei Comuni (6900)])-SUMIF(Tabella1[Centro di costo*],$A$41&\" - \"&$C$41,Tabella1[di cui a carico dei Comuni (6900)])-SUMIF(Tabella1[Centro di costo*],$A$44&\" - \"&$C$44,Tabella1[di cui a carico dei Comuni (6900)]),0)","v":146489}]
[null,null,null,null,null,null,null,null,"di cui a carico del Cantone (6950)",null,null,null,{"$f":"ROUND('Cespiti ContabilitàInvestimenti'!AF107-SUMIF(Tabella1[Centro di costo*],A38&\" - \"&C38,Tabella1[di cui a carico del Cantone (6950)])-SUMIF(Tabella1[Centro di costo*],A40&\" - \"&C40,Tabella1[di cui a carico del Cantone (6950)])-SUMIF(Tabella1[Centro di costo*],A41&\" - \"&C41,Tabella1[di cui a carico del Cantone (6950)])-SUMIF(Tabella1[Centro di costo*],A44&\" - \"&C44,Tabella1[di cui a carico del Cantone (6950)]),0)","v":486115}]
[null,null,null,null,null,null,null,null,"di cui a carico della Confederazione (6960)",null,null,null,{"$f":"ROUND('Cespiti ContabilitàInvestimenti'!AG107-SUMIF(Tabella1[Centro di costo*],A38&\" - \"&C38,Tabella1[di cui a carico della Confederazione (6960)])-SUMIF(Tabella1[Centro di costo*],A40&\" - \"&C40,Tabella1[di cui a carico della Confederazione (6960)])-SUMIF(Tabella1[Centro di costo*],A41&\" - \"&C41,Tabella1[di cui a carico della Confederazione (6960)])-SUMIF(Tabella1[Centro di costo*],A44&\" - \"&C44,Tabella1[di cui a carico della Confederazione (6960)]),0)","v":234255}]
[null,null,null,null,null,null,null,null,"di cui a carico di Enti privati",null,null,null,{"$f":"ROUND('Cespiti ContabilitàInvestimenti'!AH107-SUMIF(Tabella1[Centro di costo*],A38&\" - \"&C38,Tabella1[di cui a carico di Enti privati (fondaz., associaz., coop., SA, donazioni) (6970)])-SUMIF(Tabella1[Centro di costo*],A40&\" - \"&C40,Tabella1[di cui a carico di Enti privati (fondaz., associaz., coop., SA, donazioni) (6970)])-SUMIF(Tabella1[Centro di costo*],A41&\" - \"&C41,Tabella1[di cui a carico di Enti privati (fondaz., associaz., coop., SA, donazioni) (6970)])-SUMIF(Tabella1[Centro di costo*],A44&\" - \"&C44,Tabella1[di cui a carico di Enti privati (fondaz., associaz., coop., SA, donazioni) (6970)]),0)","v":535826}]